{"text_format":"1","workbook":"xlsx","n_sheets":6,"sheets":["CUADRO DE NECESIDADES","Hoja2","INSTRUCTIVO PARA LLENAR","CATALOGO","Hoja1","LISTADO IIEE"],"not_rendered":{"charts":0,"images":4,"macros":1,"external_links":1,"defined_names":13,"comments":0,"pivot_tables":0},"unopened":[],"bounds":{"document_bytes":16777216,"sheet_cells":100000,"rows_first":2000,"rows_last":500,"rows_between":2000,"halvings":0,"cell_chars":16384,"cell_head_chars":4096},"cells_cut":0,"cells_raw":0,"read":"whole","date_system":"1900"}

{"sheet":"CUADRO DE NECESIDADES","index":0,"n_rows":82,"n_cols":19,"rows_kept":82,"cut":false,"hidden":false,"merged":[[59,4,59,7],[60,4,60,7],[61,4,61,7],[78,4,78,7],[67,4,67,7],[69,4,69,7],[70,4,70,7],[62,4,62,7],[63,4,63,7],[64,4,64,7],[65,4,65,7],[66,4,66,7],[68,4,68,7],[71,4,71,7],[72,4,72,7],[73,4,73,7],[74,4,74,7],[75,4,75,7],[53,4,53,7],[54,4,54,7],[55,4,55,7],[56,4,56,7],[57,4,57,7],[58,4,58,7],[41,4,41,7],[42,4,42,7],[43,4,43,7],[44,4,44,7],[45,4,45,7],[46,4,46,7],[47,4,47,7],[48,4,48,7],[49,4,49,7],[50,4,50,7],[51,4,51,7],[52,4,52,7],[32,4,32,7],[33,4,33,7],[34,4,34,7],[35,4,35,7],[36,4,36,7],[37,4,37,7],[38,4,38,7],[39,4,39,7],[40,4,40,7],[23,12,23,13],[24,12,24,13],[25,12,25,13],[26,12,26,13],[27,12,27,13],[28,12,28,13],[31,4,31,7],[23,10,23,11],[24,10,24,11],[25,10,25,11],[26,10,26,11],[27,10,27,11],[28,10,28,11],[29,10,29,11],[30,10,30,11],[31,10,31,11],[23,4,23,7],[24,4,24,7],[25,4,25,7],[26,4,26,7],[27,4,27,7],[28,4,28,7],[9,12,9,13],[10,10,10,11],[10,12,10,13],[11,12,11,13],[12,10,12,11],[12,12,12,13],[13,10,13,11],[13,12,13,13],[9,4,9,7],[10,4,10,7],[11,4,11,7],[12,4,12,7],[13,4,13,7],[9,10,9,11],[11,10,11,11],[6,14,6,15],[6,0,6,4],[0,4,0,12],[1,4,1,12],[0,15,0,17],[0,13,0,14],[7,10,7,11],[3,12,3,13],[5,12,5,13],[7,12,7,13],[3,10,3,11],[5,10,5,11],[4,0,4,3],[5,4,5,8],[3,7,3,8],[7,7,7,8],[3,0,3,2],[1,13,1,14],[1,15,1,17],[79,4,79,7],[80,4,80,7],[77,4,77,7],[76,4,76,7],[14,12,14,13],[15,10,15,11],[15,12,15,13],[16,10,16,11],[14,4,14,7],[15,4,15,7],[16,4,16,7],[14,10,14,11],[22,4,22,7],[18,4,18,7],[19,4,19,7],[20,4,20,7],[21,4,21,7],[21,10,21,11],[17,4,17,7],[21,12,21,13],[22,10,22,11],[22,12,22,13],[29,4,29,7],[30,4,30,7],[32,10,32,11],[34,10,34,11],[35,10,35,11],[36,10,36,11],[37,10,37,11],[38,10,38,11],[39,10,39,11],[16,12,16,13],[17,10,17,11],[17,12,17,13],[18,10,18,11],[18,12,18,13],[19,10,19,11],[19,12,19,13],[20,10,20,11],[20,12,20,13],[29,12,29,13],[30,12,30,13],[31,12,31,13],[32,12,32,13],[33,12,33,13],[34,12,34,13],[35,12,35,13],[36,12,36,13],[37,12,37,13],[38,12,38,13],[39,12,39,13],[40,10,40,11],[41,10,41,11],[42,10,42,11],[43,10,43,11],[44,10,44,11],[46,10,46,11],[40,12,40,13],[41,12,41,13],[42,12,42,13],[43,12,43,13],[44,12,44,13],[45,12,45,13],[46,12,46,13],[47,10,47,11],[48,10,48,11],[49,10,49,11],[50,10,50,11],[51,10,51,11],[52,10,52,11],[53,10,53,11],[54,10,54,11],[55,10,55,11],[47,12,47,13],[48,12,48,13],[49,12,49,13],[50,12,50,13],[51,12,51,13],[52,12,52,13],[53,12,53,13],[54,12,54,13],[55,12,55,13],[56,10,56,11],[57,10,57,11],[58,10,58,11],[59,10,59,11],[56,12,56,13],[57,12,57,13],[58,12,58,13],[59,12,59,13],[60,10,60,11],[60,12,60,13],[61,10,61,11],[61,12,61,13],[62,10,62,11],[62,12,62,13],[63,10,63,11],[63,12,63,13],[64,10,64,11],[64,12,64,13],[65,10,65,11],[65,12,65,13],[66,10,66,11],[66,12,66,13],[67,10,67,11],[67,12,67,13],[68,10,68,11],[68,12,68,13],[69,10,69,11],[69,12,69,13],[70,10,70,11],[70,12,70,13],[71,10,71,11],[71,12,71,13],[72,10,72,11],[72,12,72,13],[73,10,73,11],[73,12,73,13],[74,10,74,11],[74,12,74,13],[75,10,75,11],[75,12,75,13],[79,12,79,13],[80,12,80,13],[77,10,77,11],[77,12,77,13],[78,10,78,11],[78,12,78,13],[79,10,79,11],[80,10,80,11],[76,10,76,11],[76,12,76,13],[15,1,15,2],[16,1,16,2],[17,1,17,2],[18,1,18,2],[19,1,19,2],[20,1,20,2],[21,1,21,2],[5,0,5,2],[7,0,7,2],[9,1,9,2],[10,1,10,2],[11,1,11,2],[12,1,12,2],[13,1,13,2],[14,1,14,2],[29,1,29,2],[30,1,30,2],[31,1,31,2],[32,1,32,2],[33,1,33,2],[34,1,34,2],[35,1,35,2],[36,1,36,2],[22,1,22,2],[23,1,23,2],[24,1,24,2],[25,1,25,2],[26,1,26,2],[27,1,27,2],[28,1,28,2],[37,1,37,2],[38,1,38,2],[39,1,39,2],[40,1,40,2],[41,1,41,2],[42,1,42,2],[43,1,43,2],[44,1,44,2],[45,1,45,2],[46,1,46,2],[47,1,47,2],[48,1,48,2],[49,1,49,2],[50,1,50,2],[51,1,51,2],[52,1,52,2],[53,1,53,2],[54,1,54,2],[55,1,55,2],[56,1,56,2],[57,1,57,2],[58,1,58,2],[59,1,59,2],[60,1,60,2],[61,1,61,2],[62,1,62,2],[63,1,63,2],[77,1,77,2],[78,1,78,2],[79,1,79,2],[80,1,80,2],[73,1,73,2],[74,1,74,2],[75,1,75,2],[76,1,76,2],[64,1,64,2],[65,1,65,2],[66,1,66,2],[67,1,67,2],[68,1,68,2],[69,1,69,2],[70,1,70,2],[71,1,71,2],[72,1,72,2]]}
[null,null,null,null,"         UNIDAD DE GESTION EDUCATIVA LOCAL PUNO UE 311",null,null,null,null,null,null,null,null,"DISTRITO",null,{"$f":"+VLOOKUP(E4,'LISTADO IIEE'!D2:J875,7,FALSE)","v":"Puno"}]
[null,null,null,null,"CUADRO DE NECESIDADES 2018",null,null,null,null,null,null,null,null,"AREA",null,{"$f":"+VLOOKUP(E4,'LISTADO IIEE'!D2:K875,8,FALSE)","v":"Urbana"}]
[null,null,null,null,null,null,null,null,null,null,null,null,null,null,null,{"$f":"SUM(P13:P81)","v":0},null,{"$f":"SUM(P13:P81)","v":0}]
["Codigo Modular del Centro de Costo",null,null,null,"1331883",null,"Numero de Celular",null,null,null,"Nº de Alum. Matriculados",null,{"$f":"+VLOOKUP(E4,'LISTADO IIEE'!D2:I875,6,FALSE)","v":130}]
[]
["Institucion Educativa",null,null,null,{"$f":"+VLOOKUP(E4,'LISTADO IIEE'!D2:E875,2,FALSE)","v":"CEBA - VILLA DEL LAGO"},null,null,null,null,null,"Nº Docentes",null,0,null,null,2340]
[]
["Nombres y Apellidos del Director",null,null,null,null,null,"Correo Electronico",null,null,null,"Nº de Aulas",null,0,null,"Aprobado",12," - Aprobado",{"$f":"+Q8","v":" - Aprobado"}]
[]
["CODIGO INTERNO","Clasificador de Gasto",null,"CATALOGO SIGA","DESCRIPCIÓN",null,null,null,"Unidad\nde medida","Precio Estimado","I DOTACION\nENERO - JUNIO",null,"II DOTACION\nJULIO - DICIEMBRE",null,"CANTIDAD","TOTAL","C.M","OBSERVACIONES","CLASIFICADOR"]
[1,null,null,{"$f":"IF(A11=\"\",\"\",VLOOKUP(A11,CATALOGO,2,FALSE))","v":"870100010001"},{"$f":"IF(A11=\"\",\"\",VLOOKUP(A11,CATALOGO,3,FALSE))","v":"SERVICIO DE AGUA POTABLE"},null,null,null,{"$f":"IF(A11=\"\",\"\",VLOOKUP(A11,CATALOGO,4,FALSE))","v":"SERVICIO"},1,{"$f":"+VLOOKUP(E4,'LISTADO IIEE'!D2:L875,9,FALSE)","v":0},null,{"$f":"+K11","v":0},null,{"$f":"IF(A11=\"\",\"\",(L11+M11+N11+K11))","v":0},{"$f":"IF(J11=\"\",\"\",(J11*O11))","v":0},{"$f":"+E$4","v":"1331883"},null,{"$f":"IF(A11=\"\",\"\",VLOOKUP(A11,CATALOGO,6,FALSE))","v":0}]
[2,null,null,"870100020003","SERVICIO DE ENERGIA ELECTRICA",null,null,null,"SERVICIO",1,{"$f":"+VLOOKUP(E4,'LISTADO IIEE'!D2:M875,10,FALSE)","v":0},null,{"$f":"+K12","v":0},null,0,0,{"$f":"+E$4","v":"1331883"},null,"2.3. 1 5. 3 1"]
[null,null,null,"","",null,null,null,"",{"$f":"IF(A13=\"\",\"\",VLOOKUP(A13,CATALOGO,5,FALSE))","v":""},null,null,null,null,"","","1331883",null,""]
[null,null,null,"","",null,null,null,"","",null,null,null,null,"","","1331883",null,""]
[null,null,null,"","",null,null,null,"","",null,null,null,null,"","","1331883",null,""]
[null,null,null,"","",null,null,null,"","",null,null,null,null,"","","1331883",null,""]
[null,null,null,"","",null,null,null,"","",null,null,null,null,"","","1331883",null,""]
[null,null,null,"","",null,null,null,"","",null,null,null,null,"","","1331883",null,""]
[null,null,null,"","",null,null,null,"","",null,null,null,null,"","","1331883",null,""]
[null,null,null,"","",null,null,null,"","",null,null,null,null,"","","1331883",null,""]
{"$rows_left_out":63}
{"sheet":"Hoja2","index":1,"n_rows":15,"n_cols":3,"rows_kept":15,"cut":false,"hidden":true,"merged":[]}
["1. PUNO."]
["2. ACORA.",null,5]
["3. AMANTANI."]
["4. ATUNCOLLA."]
["5. CAPACHICA."]
["6. CHUCUITO."]
["7. COATA."]
["8. HUATA."]
["9. MAÑAZO."]
["10. PAUCARCOLLA."]
["11. PICHACANI (Laraqueri)."]
["12. PLATERIA."]
["13. SAN ANTONIO (San Antonio de Esquilache)."]
["14. TIQUILLACA."]
["15. VILQUE."]

{"sheet":"INSTRUCTIVO PARA LLENAR","index":2,"n_rows":79,"n_cols":12,"rows_kept":79,"cut":false,"hidden":false,"merged":[[4,1,4,2],[4,3,4,4],[8,1,8,2],[8,3,8,4],[1,3,1,6],[8,6,8,7],[5,1,5,2],[6,1,6,2],[6,6,6,7],[7,1,7,3],[1,7,1,8],[1,9,1,10],[2,3,2,6],[7,8,7,9],[4,6,4,7]]}
[]
[null,null,null,"UNIDAD DE GESTION EDUCATIVA PUNO",null,null,null,"DISTRITO",null,"ATUNCOLLA"]
[null,null,null,"CUADRO DE NECESIDADES 2018"]
[]
[null,"Centro de Costo \nInstitucion Educativa",null,70000,null,null,120]
[null,null,null,null,null,null,null,null,0]
[null,"Codigo Modular",null,70020041,null,null,3,null,null,123]
[]
[null,"Nombres y Apellidos DIRECTOR(e)(a)",null,"JUAN PEREZ PEREZ",null,null,4,null,null,{"$f":"SUM(J12:J81)","v":{"$error":"#REF!"}}]
[]
[null,"CODIGO INTERNO","CATALOGO SIGA","DESCRIPCIÓN","Unidad\nde medida","Precio Estimado","I DOTACION","II DOTACION","CANTIDAD","TOTAL","OBSERVACIONES","CLASIFICADOR"]
[null,1,{"$f":"IF(B12=\"\",\"\",VLOOKUP(B12,CATALOGO,2,FALSE))","v":"870100010001"},{"$f":"IF(B12=\"\",\"\",VLOOKUP(B12,CATALOGO,3,FALSE))","v":"SERVICIO DE AGUA POTABLE"},{"$f":"IF(B12=\"\",\"\",VLOOKUP(B12,CATALOGO,4,FALSE))","v":"SERVICIO"},{"$f":"IF(B12=\"\",\"\",VLOOKUP(B12,CATALOGO,5,FALSE))","v":0},null,null,{"$f":"IF(B12=\"\",\"\",(#REF!+G12+H12+#REF!))","v":{"$error":"#REF!"}},{"$f":"IF(F12=\"\",\"\",(F12*I12))","v":{"$error":"#REF!"}},null,{"$f":"IF(B12=\"\",\"\",VLOOKUP(B12,CATALOGO,6,FALSE))","v":0}]
[null,2,"870100020003","SERVICIO DE ENERGIA ELECTRICA","SERVICIO",0,null,null,{"$f":"IF(B13=\"\",\"\",(#REF!+G13+H13+#REF!))","v":{"$error":"#REF!"}},{"$error":"#REF!"}]
[null,3,"133000270008","LIMPIA VIDRIO EN SPRAY X 1L","UNIDAD",6,null,null,{"$f":"IF(B14=\"\",\"\",(#REF!+G14+H14+#REF!))","v":{"$error":"#REF!"}},{"$error":"#REF!"}]
[null,4,"133000220009","KRESO X 1 L","UNIDAD",3.5,null,null,{"$f":"IF(B15=\"\",\"\",(#REF!+G15+H15+#REF!))","v":{"$error":"#REF!"}},{"$error":"#REF!"}]
[null,5,"135000050045","ESCOBA BAJA POLICIA DE 2 PITAS 2 ZUNCHOS","UNIDAD",7.5,null,null,{"$f":"IF(B16=\"\",\"\",(#REF!+G16+H16+#REF!))","v":{"$error":"#REF!"}},{"$error":"#REF!"}]
[null,6,"135000080025","ESCOBILLON DE CERDA PARA PISO X 30 cm","UNIDAD",6.8,null,null,{"$f":"IF(B17=\"\",\"\",(#REF!+G17+H17+#REF!))","v":{"$error":"#REF!"}},{"$error":"#REF!"}]
[null,7,"135000130006","RECOGEDOR DE PLASTICO TAMAÑO GRANDE","UNIDAD",5.9,null,null,{"$f":"IF(B18=\"\",\"\",(#REF!+G18+H18+#REF!))","v":{"$error":"#REF!"}},{"$error":"#REF!"}]
[null,8,"135000360004","GUANTE DE JEBE DE USO DOMESTICO TALLA 7","PAR",4.0199999999999996,null,null,{"$f":"IF(B19=\"\",\"\",(#REF!+G19+H19+#REF!))","v":{"$error":"#REF!"}},{"$error":"#REF!"}]
[null,9,"139200100117","JABON CARBOLICO EN BARRA X 200 g","UNIDAD",1,null,null,{"$f":"IF(B20=\"\",\"\",(#REF!+G20+H20+#REF!))","v":{"$error":"#REF!"}},{"$error":"#REF!"}]
{"$rows_left_out":60}
{"sheet":"CATALOGO","index":3,"n_rows":81,"n_cols":7,"rows_kept":81,"cut":false,"hidden":false,"merged":[]}
["N°","CODIGO","NOMBRE DE ITEM","UNIDAD","PRECIO ESTIMADO","CLASIFICADOR"]
[1,"870100010001","SERVICIO DE AGUA POTABLE","SERVICIO"]
[2,"870100020003","SERVICIO DE ENERGIA ELECTRICA","SERVICIO",null,"2.3. 1 5. 3 1"]
[3,"133000270008","LIMPIA VIDRIO EN SPRAY X 1L","UNIDAD",6,"2.3. 1 5. 3 1"]
[4,"133000220009","KRESO X 1 L","UNIDAD",3.5,"2.3. 1 5. 3 1"]
[5,"135000050045","ESCOBA BAJA POLICIA DE 2 PITAS 2 ZUNCHOS","UNIDAD",7.5,"2.3. 1 5. 3 1"]
[6,"135000080025","ESCOBILLON DE CERDA PARA PISO X 30 cm","UNIDAD",6.8,"2.3. 1 5. 3 1"]
[7,"135000130006","RECOGEDOR DE PLASTICO TAMAÑO GRANDE","UNIDAD",5.9,"2.3. 1 5. 3 1"]
[8,"135000360004","GUANTE DE JEBE DE USO DOMESTICO TALLA 7","PAR",4.0199999999999996,"2.3. 1 5. 3 1"]
[9,"139200100117","JABON CARBOLICO EN BARRA X 200 g","UNIDAD",1,"2.3. 1 5. 3 1"]
[10,"646100030027","TACHO DE PLÁSTICO TIPO SANSON 100 L APROX.","UNIDAD",59.98,"2.3. 1 5. 3 1"]
[11,"646100030240","TACHO DE POLIETILENO PARA RECICLAJE DE BASURA 16 L APROX.","UNIDAD",18.5,"2.3. 1 5. 3 1"]
[12,"646100080005","ANTISARRO PARA WATER","UNIDAD",3.2,"2.3. 1 5. 3 1"]
[13,"895700081005","TELA FRANELA 1.00 m X 1.50 m","UNIDAD",5.5,"2.3. 1 5. 1 2"]
[14,"235200040014","JUEGO DE AJEDREZ","UNIDAD",15]
[15,"239400050007","NET PARA VOLEY","UNIDAD",54,"2.3. 1 3. 1 1"]
[16,"239400060013","PELOTA DE BASQUETBOL Nº 5","UNIDAD",39]
[17,"239400060042","PELOTA DE GOMA PARA BASQUETBOL N° 07","UNIDAD",45,"2.3. 1 9. 1 2"]
[18,"239400060034","PELOTA DE FUTSAL Nº 3.5","UNIDAD",52,"2.3. 1 9. 1 2"]
[19,"239400060067","PELOTA DE GOMA DE VOLEIBOL","UNIDAD",39,"2.3. 1 9. 1 2"]
{"$rows_left_out":62}
{"sheet":"Hoja1","index":4,"n_rows":409,"n_cols":41,"rows_kept":409,"cut":false,"hidden":true,"merged":[]}
["item_bien","nombre_item","unidad_medida","estado","grupo_bien","clase_bien","familia_bien","estado_mef","unidad_medida","ano_eje","sec_ejec","tipo_bien","precio_ref","unidad_medida","fecha_reg","estado","cuser_id","equipo_reg","indicador","fecha_ref","cuser_modif","flag_proc_cn","flag_check","cantidad_cn","cantidad_cn2","cantidad_cn3","precio_ref_origen","flag_activo","cant_unidad","nombre","unidad_adquis","flag_estado","unidad_adqu","precio_compra","fecha_compra","concate",null,"CODIGO","NOMBRE DE ITEM","UNIDAD","PRECIO ESTIMADO"]
["0014","REFRIGERIO",112,"A","09","79","0004","A",112,2016,1505,"B",8,112,"23/06/2015 02:34:42.186","A","02050907","A_SIGA","2","23/06/2015 02:34:42.186","02050907",null,"0",0,0,0,0,"N",0,"UNIDAD",112,null,"UNIDAD",0,null,{"$f":"CONCATENATE(E2,F2,G2,A2)","v":"097900040014"},null,{"$f":"+AJ2","v":"097900040014"},{"$f":"+B2","v":"REFRIGERIO"},{"$f":"+AG2","v":"UNIDAD"},{"$f":"+M2","v":8}]
[]
["0034","CERA AL AGUA PARA PISO COLOR ROJO",346,"A","13","30","0007","A",346,2016,1004,"B",27,346,"03/06/2015 10:58:38.11","A","04744514","A_SIGA","2","08/06/2015 14:53:26.64","01980772",null,"0",0,0,0,0,"N",0,"GALON",346,null,"GALON",0,null,{"$f":"CONCATENATE(E4,F4,G4,A4)","v":"133000070034"},null,{"$f":"+AJ4","v":"133000070034"},{"$f":"+B4","v":"CERA AL AGUA PARA PISO COLOR ROJO"},{"$f":"+AG4","v":"GALON"},{"$f":"+M4","v":27}]
["0037","CERA AL AGUA PARA PISO COLOR AMARILLO",346,"A","13","30","0007","A",346,2016,1004,"B",24,346,"03/06/2015 10:58:38.11","A","04744514","A_SIGA","2","08/06/2015 14:53:26.64","01980772",null,"0",0,0,0,0,"N",0,"GALON",346,null,"GALON",0,null,"133000070037",null,"133000070037","CERA AL AGUA PARA PISO COLOR AMARILLO","GALON",24]
["0043","CERA LIQUIDA PARA PISO COLOR ROJO",346,"A","13","30","0007","A",346,2016,1004,"B",24,346,"03/06/2015 10:58:38.11","A","04744514","A_SIGA","2","08/06/2015 14:53:26.64","01980772",null,"0",0,0,0,0,"N",0,"GALON",346,null,"GALON",0,null,"133000070043",null,"133000070043","CERA LIQUIDA PARA PISO COLOR ROJO","GALON",24]
["0032","CERA EN PASTA PARA PISO COLOR AMARILLO",346,"A","13","30","0008","A",346,2016,1004,"B",24,346,"03/06/2015 10:58:38.11","A","04744514","A_SIGA","2","08/06/2015 14:53:26.64","01980772",null,"0",0,0,0,0,"N",0,"GALON",346,null,"GALON",0,null,"133000080032",null,"133000080032","CERA EN PASTA PARA PISO COLOR AMARILLO","GALON",24]
["0033","CERA EN PASTA PARA PISO COLOR ROJO",346,"A","13","30","0008","A",346,2016,1004,"B",24,346,"03/06/2015 10:58:38.11","A","04744514","A_SIGA","2","08/06/2015 14:53:26.64","01980772",null,"0",0,0,0,0,"N",0,"GALON",346,null,"GALON",0,null,"133000080033",null,"133000080033","CERA EN PASTA PARA PISO COLOR ROJO","GALON",24]
["0077","AMBIENTADOR EN SPRAY X 400 mL APROX.",112,"A","13","30","0014","A",112,2016,1505,"B",9,112,"04/06/2015 21:59:24.516","A","02050907","A_SIGA","2","04/06/2015 21:59:24.516","02050907",null,"0",0,0,0,0,"N",0,"UNIDAD",112,null,"UNIDAD",0,null,"133000140077",null,"133000140077","AMBIENTADOR EN SPRAY X 400 mL APROX.","UNIDAD",9]
["0001","KRESO",349,"A","13","30","0022","A",349,2016,1004,"B",3.2,349,"08/06/2015 09:09:46.343","A","01980772","ESCAL1","2","08/06/2015 14:53:26.64","01980772",null,"0",0,0,0,0,"N",0,"LITRO",349,null,"LITRO",null,null,"133000220001",null,"133000220001","KRESO","LITRO",3.2]
["0009","KRESO X 1 L",112,"A","13","30","0022","A",112,2016,1505,"B",4,112,"04/06/2015 21:59:24.516","A","02050907","A_SIGA","2","08/06/2015 02:32:33.403","02050907",null,"0",0,0,0,0,"N",0,"UNIDAD",112,null,"UNIDAD",0,null,"133000220009",null,"133000220009","KRESO X 1 L","UNIDAD",4]
["0010","KRESO X 1 gal",112,"A","13","30","0022","A",112,2016,1505,"B",3.9,112,"17/06/2015 20:52:28.193","A","02050907","A_SIGA","2","21/06/2015 21:57:51.323","02050907",null,"0",0,0,0,0,"N",0,"UNIDAD",112,null,"UNIDAD",0,null,"133000220010",null,"133000220010","KRESO X 1 gal","UNIDAD",3.9]
["0045","ESCOBA BAJA POLICIA DE 2 PITAS 2 ZUNCHOS",112,"A","13","50","0005","A",112,2016,1505,"B",10,112,"04/06/2015 21:59:24.516","A","02050907","A_SIGA","2","08/06/2015 02:32:33.403","02050907",null,"0",0,0,0,0,"N",0,"UNIDAD",112,null,"UNIDAD",0,null,"135000050045",null,"135000050045","ESCOBA BAJA POLICIA DE 2 PITAS 2 ZUNCHOS","UNIDAD",10]
["0047","ESCOBA DE NAILON 2 HILERAS",112,"A","13","50","0005","A",112,2016,1004,"B",5.8,112,"03/06/2015 10:58:38.11","A","04744514","A_SIGA","2","08/06/2015 14:53:26.64","01980772",null,"0",0,0,0,0,"N",0,"UNIDAD",112,null,"UNIDAD",0,null,"135000050047",null,"135000050047","ESCOBA DE NAILON 2 HILERAS","UNIDAD",5.8]
["0126","ESCOBILLA CIRCULAR DE NAILON PARA INODORO",112,"A","13","50","0006","A",112,2016,1004,"B",2.5,112,"03/06/2015 10:58:38.11","A","04744514","A_SIGA","2","08/06/2015 14:53:26.64","01980772",null,"0",0,0,0,0,"N",0,"UNIDAD",112,null,"UNIDAD",0,null,"135000060126",null,"135000060126","ESCOBILLA CIRCULAR DE NAILON PARA INODORO","UNIDAD",2.5]
["0025","ESCOBILLON DE CERDA PARA PISO X 30 cm",112,"A","13","50","0008","A",112,2016,1505,"B",9,112,"04/06/2015 21:59:24.516","A","02050907","A_SIGA","2","08/06/2015 02:32:33.403","02050907",null,"0",0,0,0,0,"N",0,"UNIDAD",112,null,"UNIDAD",0,null,"135000080025",null,"135000080025","ESCOBILLON DE CERDA PARA PISO X 30 cm","UNIDAD",9]
["0079","ESCOBILLON DE CERDA PLASTICA DE 90 cm",112,"A","13","50","0008","A",112,2016,1505,"B",9,112,"17/06/2015 20:52:28.193","A","02050907","A_SIGA","2","18/06/2015 20:51:35.89","02050907",null,"0",0,0,0,0,"N",0,"UNIDAD",112,null,"UNIDAD",0,null,"135000080079",null,"135000080079","ESCOBILLON DE CERDA PLASTICA DE 90 cm","UNIDAD",9]
["0039","ESPONJA DE ESPUMA SINTETICA",112,"A","13","50","0009","A",112,2016,1004,"B",3.1269999999999998,112,"18/06/2015 10:00:33.72","A","04744514","A_SIGA","2","18/06/2015 10:00:33.72","04744514",null,"0",0,0,0,0,"N",0,"UNIDAD",112,null,"UNIDAD",0,null,"135000090039",null,"135000090039","ESPONJA DE ESPUMA SINTETICA","UNIDAD",3.1269999999999998]
["0006","RECOGEDOR DE PLASTICO TAMAÑO GRANDE",112,"A","13","50","0013","A",112,2016,1505,"B",5.9,112,"04/06/2015 21:59:24.516","A","02050907","A_SIGA","2","08/06/2015 02:32:33.403","02050907",null,"0",0,0,0,0,"N",0,"UNIDAD",112,null,"UNIDAD",null,null,"135000130006",null,"135000130006","RECOGEDOR DE PLASTICO TAMAÑO GRANDE","UNIDAD",5.9]
["0007","RECOGEDOR DE PLASTICO TAMAÑO MEDIANO",112,"A","13","50","0013","A",112,2016,1004,"B",6.68,112,"04/06/2015 15:07:32.983","A","01980772","ESCAL1","2","08/06/2015 14:53:26.64","01980772",null,"0",0,0,0,0,"N",0,"UNIDAD",112,null,"UNIDAD",null,null,"135000130007",null,"135000130007","RECOGEDOR DE PLASTICO TAMAÑO MEDIANO","UNIDAD",6.68]
{"$rows_left_out":390}
{"sheet":"LISTADO IIEE","index":5,"n_rows":875,"n_cols":13,"rows_kept":875,"cut":false,"hidden":true,"merged":[]}
["N°","Distrito","Centro Poblado","Cód. Mod.","Nombre de IE","Nivel","Modalidad","Tipo IE","Total  de estudiantes matriculados (*)",null,"area","servicio de energia "]
[509,"PUNO","PUNO","1023431","I.E.I.  - 327","I.E.I.","Educación Básica Regular      ","A1  - Pública - Sector Educación                                  ",54,{"$f":"+B2","v":"PUNO"},"Urbana",null,60.61]
[827,"PUNO","JAYLLIHUAYA","1024074","I.E.S.  - CARLOS DANTE NAVA","I.E.S.","Educación Básica Regular      ","A1  - Pública - Sector Educación                                  ",50,"PUNO","Urbana",645.95000000000005,158.90999999999997]
[365,"PUNO","VILLA COPA CABANA","1571462","I.E.I.  - 239 NIÑO JESUS DE PRAGA","I.E.I.","Educación Básica Regular      ","A1  - Pública - Sector Educación                                  ",9,"PUNO","Urbana",56.05,170.56]
[502,"PUNO","LAYKAKOTA","0618363","I.E.I.  - 274","I.E.I.","Educación Básica Regular      ","A1  - Pública - Sector Educación                                  ",76,"PUNO","Urbana",177.35,266.82]
[497,"PUNO","SANTA ROSA","0701482","I.E.I.  - 322","I.E.I.","Educación Básica Regular      ","A1  - Pública - Sector Educación                                  ",74,"PUNO","Urbana",92.149999999999991,302.25]
[506,"PUNO","BARRIO LLAVINI","0618371","I.E.I.  - 275","I.E.I.","Educación Básica Regular      ","A1  - Pública - Sector Educación                                  ",62,"PUNO","Urbana",70.75,332.47999999999996]
[355,"PUNO","PUNO","1679356","I.E.I.  - VALLECITO","I.E.I.","Educación Básica Regular      ","A1  - Pública - Sector Educación                                  ",20,"PUNO","Urbana",42.25,333.68999999999994]
[504,"PUNO","PUNO","0618397","I.E.I.  - 278","I.E.I.","Educación Básica Regular      ","A1  - Pública - Sector Educación                                  ",110,"PUNO","Urbana",670.45,365]
[841,"PUNO","PUNO","0701557","I.E.S.  - SAN JOSE","I.E.S.","Educación Básica Regular      ","A1  - Pública - Sector Educación                                  ",102,"PUNO","Urbana",719.9,379.15999999999997]
[596,"PUNO","PUNO","0230235","I.E.P.   - 70013","I.E.P. ","Educación Básica Regular      ","A1  - Pública - Sector Educación                                  ",40,"PUNO","Urbana",857.7,392.51]
[362,"PUNO","AZIRUNI","1556323","I.E.I.  - 1211 CUIDAD JARDIN","I.E.I.","Educación Básica Regular      ","A1  - Pública - Sector Educación                                  ",68,"PUNO","Urbana",287.70000000000005,395.73]
[608,"PUNO","JAYLLIHUAYA","0230979","I.E.P.   - 70090","I.E.P. ","Educación Básica Regular      ","A1  - Pública - Sector Educación                                  ",44,"PUNO","Urbana",1364.6,402.49]
[619,"PUNO","PUNO","0804286","I.E.P.   - 70717","I.E.P. ","Educación Básica Regular      ","A1  - Pública - Sector Educación                                  ",59,"PUNO","Urbana",272.60000000000002,411.79999999999995]
[494,"PUNO","MAGISTERIAL","0548511","I.E.I.  - 248","I.E.I.","Educación Básica Regular      ","A1  - Pública - Sector Educación                                  ",87,"PUNO","Urbana",139.5,428.29]
[591,"PUNO","PUNO","0230284","I.E.P.   - 70018 SAN JOSE DE HUARAYA","I.E.P. ","Educación Básica Regular      ","A1  - Pública - Sector Educación                                  ",91,"PUNO","Urbana",759.10000000000014,481.3]
[610,"PUNO","SAN MARTIN","0230722","I.E.P.   - 70064 SAN MARTIN DE PORRES","I.E.P. ","Educación Básica Regular      ","A1  - Pública - Sector Educación                                  ",48,"PUNO","Urbana",335.99999999999994,508.86]
[624,"PUNO","PUNO","0618439","I.E.P.   - 70657","I.E.P. ","Educación Básica Regular      ","A1  - Pública - Sector Educación                                  ",19,"PUNO","Urbana",2104.85,568.03000000000009]
[487,"PUNO","CHACARILLA DEL LAGO","0474353","I.E.I.  - 219 SANTA ROSA DE LIMA","I.E.I.","Educación Básica Regular      ","A1  - Pública - Sector Educación                                  ",76,"PUNO","Urbana",74.7,599.1]
[501,"PUNO","SAN MARTIN","0660258","I.E.I.  - 284 CARLOS DREYER","I.E.I.","Educación Básica Regular      ","A1  - Pública - Sector Educación                                  ",64,"PUNO","Urbana",53.050000000000004,644.49]
{"$rows_left_out":855}