{"text_format":"1","workbook":"xlsx","n_sheets":6,"sheets":["CUADRO DE NECESIDADES","Hoja2","INSTRUCTIVO PARA LLENAR","CATALOGO","Hoja1","LISTADO IIEE"],"not_rendered":{"charts":0,"images":4,"macros":1,"external_links":1,"defined_names":13,"comments":0,"pivot_tables":0},"unopened":[],"bounds":{"document_bytes":16777216,"sheet_cells":100000,"rows_first":2000,"rows_last":500,"rows_between":2000,"halvings":0,"cell_chars":16384,"cell_head_chars":4096},"cells_cut":0,"cells_raw":0,"read":"whole","date_system":"1900"}

{"sheet":"CUADRO DE NECESIDADES","index":0,"n_rows":82,"n_cols":19,"rows_kept":82,"cut":false,"hidden":false,"merged":[[59,4,59,7],[60,4,60,7],[61,4,61,7],[78,4,78,7],[67,4,67,7],[69,4,69,7],[70,4,70,7],[62,4,62,7],[63,4,63,7],[64,4,64,7],[65,4,65,7],[66,4,66,7],[68,4,68,7],[71,4,71,7],[72,4,72,7],[73,4,73,7],[74,4,74,7],[75,4,75,7],[53,4,53,7],[54,4,54,7],[55,4,55,7],[56,4,56,7],[57,4,57,7],[58,4,58,7],[41,4,41,7],[42,4,42,7],[43,4,43,7],[44,4,44,7],[45,4,45,7],[46,4,46,7],[47,4,47,7],[48,4,48,7],[49,4,49,7],[50,4,50,7],[51,4,51,7],[52,4,52,7],[32,4,32,7],[33,4,33,7],[34,4,34,7],[35,4,35,7],[36,4,36,7],[37,4,37,7],[38,4,38,7],[39,4,39,7],[40,4,40,7],[23,12,23,13],[24,12,24,13],[25,12,25,13],[26,12,26,13],[27,12,27,13],[28,12,28,13],[31,4,31,7],[23,10,23,11],[24,10,24,11],[25,10,25,11],[26,10,26,11],[27,10,27,11],[28,10,28,11],[29,10,29,11],[30,10,30,11],[31,10,31,11],[23,4,23,7],[24,4,24,7],[25,4,25,7],[26,4,26,7],[27,4,27,7],[28,4,28,7],[9,12,9,13],[10,10,10,11],[10,12,10,13],[11,12,11,13],[12,10,12,11],[12,12,12,13],[13,10,13,11],[13,12,13,13],[9,4,9,7],[10,4,10,7],[11,4,11,7],[12,4,12,7],[13,4,13,7],[9,10,9,11],[11,10,11,11],[6,14,6,15],[6,0,6,4],[0,4,0,12],[1,4,1,12],[0,15,0,17],[0,13,0,14],[7,10,7,11],[3,12,3,13],[5,12,5,13],[7,12,7,13],[3,10,3,11],[5,10,5,11],[4,0,4,3],[5,4,5,8],[3,7,3,8],[7,7,7,8],[3,0,3,2],[1,13,1,14],[1,15,1,17],[79,4,79,7],[80,4,80,7],[77,4,77,7],[76,4,76,7],[14,12,14,13],[15,10,15,11],[15,12,15,13],[16,10,16,11],[14,4,14,7],[15,4,15,7],[16,4,16,7],[14,10,14,11],[22,4,22,7],[18,4,18,7],[19,4,19,7],[20,4,20,7],[21,4,21,7],[21,10,21,11],[17,4,17,7],[21,12,21,13],[22,10,22,11],[22,12,22,13],[29,4,29,7],[30,4,30,7],[32,10,32,11],[34,10,34,11],[35,10,35,11],[36,10,36,11],[37,10,37,11],[38,10,38,11],[39,10,39,11],[16,12,16,13],[17,10,17,11],[17,12,17,13],[18,10,18,11],[18,12,18,13],[19,10,19,11],[19,12,19,13],[20,10,20,11],[20,12,20,13],[29,12,29,13],[30,12,30,13],[31,12,31,13],[32,12,32,13],[33,12,33,13],[34,12,34,13],[35,12,35,13],[36,12,36,13],[37,12,37,13],[38,12,38,13],[39,12,39,13],[40,10,40,11],[41,10,41,11],[42,10,42,11],[43,10,43,11],[44,10,44,11],[46,10,46,11],[40,12,40,13],[41,12,41,13],[42,12,42,13],[43,12,43,13],[44,12,44,13],[45,12,45,13],[46,12,46,13],[47,10,47,11],[48,10,48,11],[49,10,49,11],[50,10,50,11],[51,10,51,11],[52,10,52,11],[53,10,53,11],[54,10,54,11],[55,10,55,11],[47,12,47,13],[48,12,48,13],[49,12,49,13],[50,12,50,13],[51,12,51,13],[52,12,52,13],[53,12,53,13],[54,12,54,13],[55,12,55,13],[56,10,56,11],[57,10,57,11],[58,10,58,11],[59,10,59,11],[56,12,56,13],[57,12,57,13],[58,12,58,13],[59,12,59,13],[60,10,60,11],[60,12,60,13],[61,10,61,11],[61,12,61,13],[62,10,62,11],[62,12,62,13],[63,10,63,11],[63,12,63,13],[64,10,64,11],[64,12,64,13],[65,10,65,11],[65,12,65,13],[66,10,66,11],[66,12,66,13],[67,10,67,11],[67,12,67,13],[68,10,68,11],[68,12,68,13],[69,10,69,11],[69,12,69,13],[70,10,70,11],[70,12,70,13],[71,10,71,11],[71,12,71,13],[72,10,72,11],[72,12,72,13],[73,10,73,11],[73,12,73,13],[74,10,74,11],[74,12,74,13],[75,10,75,11],[75,12,75,13],[79,12,79,13],[80,12,80,13],[77,10,77,11],[77,12,77,13],[78,10,78,11],[78,12,78,13],[79,10,79,11],[80,10,80,11],[76,10,76,11],[76,12,76,13],[15,1,15,2],[16,1,16,2],[17,1,17,2],[18,1,18,2],[19,1,19,2],[20,1,20,2],[21,1,21,2],[5,0,5,2],[7,0,7,2],[9,1,9,2],[10,1,10,2],[11,1,11,2],[12,1,12,2],[13,1,13,2],[14,1,14,2],[29,1,29,2],[30,1,30,2],[31,1,31,2],[32,1,32,2],[33,1,33,2],[34,1,34,2],[35,1,35,2],[36,1,36,2],[22,1,22,2],[23,1,23,2],[24,1,24,2],[25,1,25,2],[26,1,26,2],[27,1,27,2],[28,1,28,2],[37,1,37,2],[38,1,38,2],[39,1,39,2],[40,1,40,2],[41,1,41,2],[42,1,42,2],[43,1,43,2],[44,1,44,2],[45,1,45,2],[46,1,46,2],[47,1,47,2],[48,1,48,2],[49,1,49,2],[50,1,50,2],[51,1,51,2],[52,1,52,2],[53,1,53,2],[54,1,54,2],[55,1,55,2],[56,1,56,2],[57,1,57,2],[58,1,58,2],[59,1,59,2],[60,1,60,2],[61,1,61,2],[62,1,62,2],[63,1,63,2],[77,1,77,2],[78,1,78,2],[79,1,79,2],[80,1,80,2],[73,1,73,2],[74,1,74,2],[75,1,75,2],[76,1,76,2],[64,1,64,2],[65,1,65,2],[66,1,66,2],[67,1,67,2],[68,1,68,2],[69,1,69,2],[70,1,70,2],[71,1,71,2],[72,1,72,2]]}
[null,null,null,null,"         UNIDAD DE GESTION EDUCATIVA LOCAL PUNO UE 311",null,null,null,null,null,null,null,null,"DISTRITO",null,{"$f":"+VLOOKUP(E4,'LISTADO IIEE'!D2:J875,7,FALSE)","v":"Puno"}]
[null,null,null,null,"CUADRO DE NECESIDADES 2018",null,null,null,null,null,null,null,null,"AREA",null,{"$f":"+VLOOKUP(E4,'LISTADO IIEE'!D2:K875,8,FALSE)","v":"Urbana"}]
[null,null,null,null,null,null,null,null,null,null,null,null,null,null,null,{"$f":"SUM(P13:P81)","v":0},null,{"$f":"SUM(P13:P81)","v":0}]
["Codigo Modular del Centro de Costo",null,null,null,"1331883",null,"Numero de Celular",null,null,null,"Nº de Alum. Matriculados",null,{"$f":"+VLOOKUP(E4,'LISTADO IIEE'!D2:I875,6,FALSE)","v":130}]
[]
["Institucion Educativa",null,null,null,{"$f":"+VLOOKUP(E4,'LISTADO IIEE'!D2:E875,2,FALSE)","v":"CEBA - VILLA DEL LAGO"},null,null,null,null,null,"Nº Docentes",null,0,null,null,2340]
[]
["Nombres y Apellidos del Director",null,null,null,null,null,"Correo Electronico",null,null,null,"Nº de Aulas",null,0,null,"Aprobado",12," - Aprobado",{"$f":"+Q8","v":" - Aprobado"}]
[]
["CODIGO INTERNO","Clasificador de Gasto",null,"CATALOGO SIGA","DESCRIPCIÓN",null,null,null,"Unidad\nde medida","Precio Estimado","I DOTACION\nENERO - JUNIO",null,"II DOTACION\nJULIO - DICIEMBRE",null,"CANTIDAD","TOTAL","C.M","OBSERVACIONES","CLASIFICADOR"]
[1,null,null,{"$f":"IF(A11=\"\",\"\",VLOOKUP(A11,CATALOGO,2,FALSE))","v":"870100010001"},{"$f":"IF(A11=\"\",\"\",VLOOKUP(A11,CATALOGO,3,FALSE))","v":"SERVICIO DE AGUA POTABLE"},null,null,null,{"$f":"IF(A11=\"\",\"\",VLOOKUP(A11,CATALOGO,4,FALSE))","v":"SERVICIO"},1,{"$f":"+VLOOKUP(E4,'LISTADO IIEE'!D2:L875,9,FALSE)","v":0},null,{"$f":"+K11","v":0},null,{"$f":"IF(A11=\"\",\"\",(L11+M11+N11+K11))","v":0},{"$f":"IF(J11=\"\",\"\",(J11*O11))","v":0},{"$f":"+E$4","v":"1331883"},null,{"$f":"IF(A11=\"\",\"\",VLOOKUP(A11,CATALOGO,6,FALSE))","v":0}]
[2,null,null,"870100020003","SERVICIO DE ENERGIA ELECTRICA",null,null,null,"SERVICIO",1,{"$f":"+VLOOKUP(E4,'LISTADO IIEE'!D2:M875,10,FALSE)","v":0},null,{"$f":"+K12","v":0},null,0,0,{"$f":"+E$4","v":"1331883"},null,"2.3. 1 5. 3 1"]
[null,null,null,"","",null,null,null,"",{"$f":"IF(A13=\"\",\"\",VLOOKUP(A13,CATALOGO,5,FALSE))","v":""},null,null,null,null,"","","1331883",null,""]
[null,null,null,"","",null,null,null,"","",null,null,null,null,"","","1331883",null,""]
[null,null,null,"","",null,null,null,"","",null,null,null,null,"","","1331883",null,""]
[null,null,null,"","",null,null,null,"","",null,null,null,null,"","","1331883",null,""]
[null,null,null,"","",null,null,null,"","",null,null,null,null,"","","1331883",null,""]
[null,null,null,"","",null,null,null,"","",null,null,null,null,"","","1331883",null,""]
[null,null,null,"","",null,null,null,"","",null,null,null,null,"","","1331883",null,""]
[null,null,null,"","",null,null,null,"","",null,null,null,null,"","","1331883",null,""]
[null,null,null,"","",null,null,null,"","",null,null,null,null,"","","1331883",null,""]
[null,null,null,"","",null,null,null,"","",null,null,null,null,"",{"$f":"IF(J22=\"\",\"\",(J22*O22))","v":""},"1331883",null,""]
[null,null,null,"","",null,null,null,"","",null,null,null,null,"","","1331883",null,""]
[null,null,null,"","",null,null,null,"","",null,null,null,null,"","","1331883",null,""]
[null,null,null,"","",null,null,null,"","",null,null,null,null,"","","1331883",null,""]
[null,null,null,"","",null,null,null,"","",null,null,null,null,"","","1331883",null,""]
[null,null,null,"","",null,null,null,"","",null,null,null,null,"","","1331883",null,""]
[null,null,null,"","",null,null,null,"","",null,null,null,null,"","","1331883",null,""]
[null,null,null,"","",null,null,null,"","",null,null,null,null,"","","1331883",null,""]
[null,null,null,"","",null,null,null,"","",null,null,null,null,"","","1331883",null,""]
[null,null,null,"","",null,null,null,"","",null,null,null,null,"","","1331883",null,""]
[null,null,null,"","",null,null,null,"","",null,null,null,null,"","","1331883",null,""]
[null,null,null,"","",null,null,null,"","",null,null,null,null,"","","1331883",null,""]
[null,null,null,"","",null,null,null,"","",null,null,null,null,"","","1331883",null,""]
[null,null,null,"","",null,null,null,"","",null,null,null,null,"","","1331883",null,""]
[null,null,null,"","",null,null,null,"","",null,null,null,null,"","","1331883",null,""]
[null,null,null,"","",null,null,null,"","",null,null,null,null,"","","1331883",null,""]
[null,null,null,"","",null,null,null,"","",null,null,null,null,"","","1331883",null,""]
[null,null,null,"","",null,null,null,"","",null,null,null,null,"","","1331883",null,""]
[null,null,null,"","",null,null,null,"","",null,null,null,null,"","","1331883",null,""]
[null,null,null,"","",null,null,null,"","",null,null,null,null,"","","1331883",null,""]
[null,null,null,"","",null,null,null,"","",null,null,null,null,"",{"$f":"IF(J42=\"\",\"\",(J42*O42))","v":""},"1331883",null,""]
[null,null,null,{"$f":"IF(A43=\"\",\"\",VLOOKUP(A43,CATALOGO,2,FALSE))","v":""},{"$f":"IF(A43=\"\",\"\",VLOOKUP(A43,CATALOGO,3,FALSE))","v":""},null,null,null,{"$f":"IF(A43=\"\",\"\",VLOOKUP(A43,CATALOGO,4,FALSE))","v":""},{"$f":"IF(A43=\"\",\"\",VLOOKUP(A43,CATALOGO,5,FALSE))","v":""},null,null,null,null,{"$f":"IF(A43=\"\",\"\",(L43+M43+N43+K43))","v":""},{"$f":"IF(J43=\"\",\"\",(J43*O43))","v":""},"1331883",null,{"$f":"IF(A43=\"\",\"\",VLOOKUP(A43,CATALOGO,6,FALSE))","v":""}]
[null,null,null,"","",null,null,null,"","",null,null,null,null,"","","1331883",null,""]
[null,null,null,"","",null,null,null,"","",null,null,null,null,"",{"$f":"IF(J45=\"\",\"\",(J45*O45))","v":""},"1331883",null,""]
[null,null,null,"","",null,null,null,"","",null,null,null,null,"","","1331883",null,""]
[null,null,null,"","",null,null,null,"","",null,null,null,null,"","","1331883",null,""]
[null,null,null,"","",null,null,null,"","",null,null,null,null,"","","1331883",null,""]
[null,null,null,"","",null,null,null,"","",null,null,null,null,"","","1331883",null,""]
[null,null,null,"","",null,null,null,"","",null,null,null,null,"","","1331883",null,""]
[null,null,null,"","",null,null,null,"","",null,null,null,null,"",{"$f":"IF(J51=\"\",\"\",(J51*O51))","v":""},"1331883",null,""]
[null,null,null,"","",null,null,null,"","",null,null,null,null,"","","1331883",null,""]
[null,null,null,"","",null,null,null,"","",null,null,null,null,"","","1331883",null,""]
[null,null,null,"","",null,null,null,"","",null,null,null,null,"","","1331883",null,""]
[null,null,null,"","",null,null,null,"","",null,null,null,null,"","","1331883",null,""]
[null,null,null,"","",null,null,null,"","",null,null,null,null,"","","1331883",null,""]
[null,null,null,"","",null,null,null,"","",null,null,null,null,"","","1331883",null,""]
[null,null,null,"","",null,null,null,"","",null,null,null,null,"","","1331883",null,""]
[null,null,null,"","",null,null,null,"","",null,null,null,null,"",{"$f":"IF(J59=\"\",\"\",(J59*O59))","v":""},"1331883",null,""]
[null,null,null,"","",null,null,null,"","",null,null,null,null,"","","1331883",null,""]
[null,null,null,"","",null,null,null,"","",null,null,null,null,"","","1331883",null,""]
[null,null,null,"","",null,null,null,"","",null,null,null,null,"","","1331883",null,""]
[null,null,null,"","",null,null,null,"","",null,null,null,null,"","","1331883",null,""]
[null,null,null,"","",null,null,null,"","",null,null,null,null,"","","1331883",null,""]
[null,null,null,"","",null,null,null,"","",null,null,null,null,"","","1331883",null,""]
[null,null,null,"","",null,null,null,"","",null,null,null,null,"","","1331883",null,""]
[null,null,null,"","",null,null,null,"","",null,null,null,null,"","","1331883",null,""]
[null,null,null,"","",null,null,null,"","",null,null,null,null,"","","1331883",null,""]
[null,null,null,"","",null,null,null,"","",null,null,null,null,"",{"$f":"IF(J69=\"\",\"\",(J69*O69))","v":""},"1331883"]
[null,null,null,"","",null,null,null,"","",null,null,null,null,"","","1331883",null,{"$f":"IF(A70=\"\",\"\",VLOOKUP(A70,CATALOGO,6,FALSE))","v":""}]
[null,null,null,"","",null,null,null,"","",null,null,null,null,"","","1331883",null,{"$f":"IF(A71=\"\",\"\",VLOOKUP(A71,CATALOGO,6,FALSE))","v":""}]
[null,null,null,"","",null,null,null,"","",null,null,null,null,"",{"$f":"IF(J72=\"\",\"\",(J72*O72))","v":""},"1331883"]
[null,null,null,"","",null,null,null,"","",null,null,null,null,"","","1331883"]
[null,null,null,"","",null,null,null,"","",null,null,null,null,"","","1331883"]
[null,null,null,{"$f":"IF(A75=\"\",\"\",VLOOKUP(A75,CATALOGO,2,FALSE))","v":""},{"$f":"IF(A75=\"\",\"\",VLOOKUP(A75,CATALOGO,3,FALSE))","v":""},null,null,null,{"$f":"IF(A75=\"\",\"\",VLOOKUP(A75,CATALOGO,4,FALSE))","v":""},{"$f":"IF(A75=\"\",\"\",VLOOKUP(A75,CATALOGO,5,FALSE))","v":""},null,null,null,null,{"$f":"IF(A75=\"\",\"\",(L75+M75+N75+K75))","v":""},"","1331883"]
[null,null,null,"","",null,null,null,"","",null,null,null,null,"","",{"$f":"+E$4","v":"1331883"}]
[null,null,null,"","",null,null,null,"","",null,null,null,null,"","","1331883"]
[null,null,null,"","",null,null,null,"","",null,null,null,null,"","","1331883"]
[null,null,null,"","",null,null,null,"","",null,null,null,null,"",{"$f":"IF(J79=\"\",\"\",(J79*O79))","v":""},"1331883"]
[null,null,null,"","",null,null,null,"","",null,null,null,null,"",{"$f":"IF(J80=\"\",\"\",(J80*O80))","v":""},"1331883"]
[null,null,null,"","",null,null,null,"","",null,null,null,null,"",{"$f":"IF(J81=\"\",\"\",(J81*O81))","v":""},"1331883"]
[null,null,null,null,null,null,null,null,null,null,null,null,null,null,null,{"$f":"SUM(P13:P81)","v":0}]

{"sheet":"Hoja2","index":1,"n_rows":15,"n_cols":3,"rows_kept":15,"cut":false,"hidden":true,"merged":[]}
["1. PUNO."]
["2. ACORA.",null,5]
["3. AMANTANI."]
["4. ATUNCOLLA."]
["5. CAPACHICA."]
["6. CHUCUITO."]
["7. COATA."]
["8. HUATA."]
["9. MAÑAZO."]
["10. PAUCARCOLLA."]
["11. PICHACANI (Laraqueri)."]
["12. PLATERIA."]
["13. SAN ANTONIO (San Antonio de Esquilache)."]
["14. TIQUILLACA."]
["15. VILQUE."]

{"sheet":"INSTRUCTIVO PARA LLENAR","index":2,"n_rows":79,"n_cols":12,"rows_kept":79,"cut":false,"hidden":false,"merged":[[4,1,4,2],[4,3,4,4],[8,1,8,2],[8,3,8,4],[1,3,1,6],[8,6,8,7],[5,1,5,2],[6,1,6,2],[6,6,6,7],[7,1,7,3],[1,7,1,8],[1,9,1,10],[2,3,2,6],[7,8,7,9],[4,6,4,7]]}
[]
[null,null,null,"UNIDAD DE GESTION EDUCATIVA PUNO",null,null,null,"DISTRITO",null,"ATUNCOLLA"]
[null,null,null,"CUADRO DE NECESIDADES 2018"]
[]
[null,"Centro de Costo \nInstitucion Educativa",null,70000,null,null,120]
[null,null,null,null,null,null,null,null,0]
[null,"Codigo Modular",null,70020041,null,null,3,null,null,123]
[]
[null,"Nombres y Apellidos DIRECTOR(e)(a)",null,"JUAN PEREZ PEREZ",null,null,4,null,null,{"$f":"SUM(J12:J81)","v":{"$error":"#REF!"}}]
[]
[null,"CODIGO INTERNO","CATALOGO SIGA","DESCRIPCIÓN","Unidad\nde medida","Precio Estimado","I DOTACION","II DOTACION","CANTIDAD","TOTAL","OBSERVACIONES","CLASIFICADOR"]
[null,1,{"$f":"IF(B12=\"\",\"\",VLOOKUP(B12,CATALOGO,2,FALSE))","v":"870100010001"},{"$f":"IF(B12=\"\",\"\",VLOOKUP(B12,CATALOGO,3,FALSE))","v":"SERVICIO DE AGUA POTABLE"},{"$f":"IF(B12=\"\",\"\",VLOOKUP(B12,CATALOGO,4,FALSE))","v":"SERVICIO"},{"$f":"IF(B12=\"\",\"\",VLOOKUP(B12,CATALOGO,5,FALSE))","v":0},null,null,{"$f":"IF(B12=\"\",\"\",(#REF!+G12+H12+#REF!))","v":{"$error":"#REF!"}},{"$f":"IF(F12=\"\",\"\",(F12*I12))","v":{"$error":"#REF!"}},null,{"$f":"IF(B12=\"\",\"\",VLOOKUP(B12,CATALOGO,6,FALSE))","v":0}]
[null,2,"870100020003","SERVICIO DE ENERGIA ELECTRICA","SERVICIO",0,null,null,{"$f":"IF(B13=\"\",\"\",(#REF!+G13+H13+#REF!))","v":{"$error":"#REF!"}},{"$error":"#REF!"}]
[null,3,"133000270008","LIMPIA VIDRIO EN SPRAY X 1L","UNIDAD",6,null,null,{"$f":"IF(B14=\"\",\"\",(#REF!+G14+H14+#REF!))","v":{"$error":"#REF!"}},{"$error":"#REF!"}]
[null,4,"133000220009","KRESO X 1 L","UNIDAD",3.5,null,null,{"$f":"IF(B15=\"\",\"\",(#REF!+G15+H15+#REF!))","v":{"$error":"#REF!"}},{"$error":"#REF!"}]
[null,5,"135000050045","ESCOBA BAJA POLICIA DE 2 PITAS 2 ZUNCHOS","UNIDAD",7.5,null,null,{"$f":"IF(B16=\"\",\"\",(#REF!+G16+H16+#REF!))","v":{"$error":"#REF!"}},{"$error":"#REF!"}]
[null,6,"135000080025","ESCOBILLON DE CERDA PARA PISO X 30 cm","UNIDAD",6.8,null,null,{"$f":"IF(B17=\"\",\"\",(#REF!+G17+H17+#REF!))","v":{"$error":"#REF!"}},{"$error":"#REF!"}]
[null,7,"135000130006","RECOGEDOR DE PLASTICO TAMAÑO GRANDE","UNIDAD",5.9,null,null,{"$f":"IF(B18=\"\",\"\",(#REF!+G18+H18+#REF!))","v":{"$error":"#REF!"}},{"$error":"#REF!"}]
[null,8,"135000360004","GUANTE DE JEBE DE USO DOMESTICO TALLA 7","PAR",4.0199999999999996,null,null,{"$f":"IF(B19=\"\",\"\",(#REF!+G19+H19+#REF!))","v":{"$error":"#REF!"}},{"$error":"#REF!"}]
[null,9,"139200100117","JABON CARBOLICO EN BARRA X 200 g","UNIDAD",1,null,null,{"$f":"IF(B20=\"\",\"\",(#REF!+G20+H20+#REF!))","v":{"$error":"#REF!"}},{"$error":"#REF!"}]
[null,10,"646100030027","TACHO DE PLÁSTICO TIPO SANSON 100 L APROX.","UNIDAD",59.98,null,null,{"$f":"IF(B21=\"\",\"\",(#REF!+G21+H21+#REF!))","v":{"$error":"#REF!"}},{"$error":"#REF!"}]
[null,11,"646100030240","TACHO DE POLIETILENO PARA RECICLAJE DE BASURA 16 L APROX.","UNIDAD",18.5,null,null,{"$f":"IF(B22=\"\",\"\",(#REF!+G22+H22+#REF!))","v":{"$error":"#REF!"}},{"$error":"#REF!"}]
[null,12,"646100080005","ANTISARRO PARA WATER","UNIDAD",3.2,null,null,{"$f":"IF(B23=\"\",\"\",(#REF!+G23+H23+#REF!))","v":{"$error":"#REF!"}},{"$error":"#REF!"}]
[null,13,"895700081005","TELA FRANELA 1.00 m X 1.50 m","UNIDAD",5.5,null,null,{"$f":"IF(B24=\"\",\"\",(#REF!+G24+H24+#REF!))","v":{"$error":"#REF!"}},{"$error":"#REF!"}]
[null,14,"235200040014","JUEGO DE AJEDREZ","UNIDAD",15,null,null,{"$f":"IF(B25=\"\",\"\",(#REF!+G25+H25+#REF!))","v":{"$error":"#REF!"}},{"$error":"#REF!"}]
[null,15,"239400050007","NET PARA VOLEY","UNIDAD",54,null,null,{"$f":"IF(B26=\"\",\"\",(#REF!+G26+H26+#REF!))","v":{"$error":"#REF!"}},{"$error":"#REF!"}]
[null,16,"239400060013","PELOTA DE BASQUETBOL Nº 5","UNIDAD",39,null,null,{"$f":"IF(B27=\"\",\"\",(#REF!+G27+H27+#REF!))","v":{"$error":"#REF!"}},{"$error":"#REF!"}]
[null,17,"239400060042","PELOTA DE GOMA PARA BASQUETBOL N° 07","UNIDAD",45,null,null,{"$f":"IF(B28=\"\",\"\",(#REF!+G28+H28+#REF!))","v":{"$error":"#REF!"}},{"$error":"#REF!"}]
[null,18,"239400060034","PELOTA DE FUTSAL Nº 3.5","UNIDAD",52,null,null,{"$f":"IF(B29=\"\",\"\",(#REF!+G29+H29+#REF!))","v":{"$error":"#REF!"}},{"$error":"#REF!"}]
[null,19,"239400060067","PELOTA DE GOMA DE VOLEIBOL","UNIDAD",39,null,null,{"$f":"IF(B30=\"\",\"\",(#REF!+G30+H30+#REF!))","v":{"$error":"#REF!"}},{"$error":"#REF!"}]
[null,20,"239400060015","PELOTA DE FUTBOL N° 5","UNIDAD",49,null,null,{"$f":"IF(B31=\"\",\"\",(#REF!+G31+H31+#REF!))","v":{"$error":"#REF!"}},{"$error":"#REF!"}]
[null,21,"239400090220","CONO DE PLASTICO PARA ENTRENAMIENTO 30 cm","UNIDAD",3.8,null,null,{"$f":"IF(B32=\"\",\"\",(#REF!+G32+H32+#REF!))","v":{"$error":"#REF!"}},{"$error":"#REF!"}]
[null,22,"710300010010","CINTA ADHESIVA TRANSPARENTE 2 in X 72 yd","UNIDAD",3.2,null,null,{"$f":"IF(B33=\"\",\"\",(#REF!+G33+H33+#REF!))","v":{"$error":"#REF!"}},{"$error":"#REF!"}]
[null,23,"710300060057","GOMA EN BARRA X 40 g APROX.","UNIDAD",8,null,null,{"$f":"IF(B34=\"\",\"\",(#REF!+G34+H34+#REF!))","v":{"$error":"#REF!"}},{"$error":"#REF!"}]
[null,24,"710300160006","CINTA DE PAPEL PARA ENMASCARAR - MASKING TAPE 2 in X 40 yd","UNIDAD",1.77,null,null,{"$f":"IF(B35=\"\",\"\",(#REF!+G35+H35+#REF!))","v":{"$error":"#REF!"}},{"$error":"#REF!"}]
[null,25,"710600010012","ARCHIVADOR DE CARTON CON PALANCA LOMO ANCHO TAMAÑO OFICIO","UNIDAD",3.6579999999999999,null,null,{"$f":"IF(B36=\"\",\"\",(#REF!+G36+H36+#REF!))","v":{"$error":"#REF!"}},{"$error":"#REF!"}]
[null,26,"710600040024","FOLDER MANILA TAMAÑO  A4","EMPAQUE X 25",7.5,null,null,{"$f":"IF(B37=\"\",\"\",(#REF!+G37+H37+#REF!))","v":{"$error":"#REF!"}},{"$error":"#REF!"}]
[null,27,"710600060005","FORRO DE PLASTICO TAMAÑO OFICIO","UNIDAD",8.9,null,null,{"$f":"IF(B38=\"\",\"\",(#REF!+G38+H38+#REF!))","v":{"$error":"#REF!"}},{"$error":"#REF!"}]
[null,28,"710600100234","SOBRE MANILA TAMAÑO  A4","EMPAQUE X 50",8.673,null,null,{"$f":"IF(B39=\"\",\"\",(#REF!+G39+H39+#REF!))","v":{"$error":"#REF!"}},{"$error":"#REF!"}]
[null,29,"711100010008","BORRADOR MIXTO TAMAÑO GRANDE","UNIDAD",0.8,null,null,{"$f":"IF(B40=\"\",\"\",(#REF!+G40+H40+#REF!))","v":{"$error":"#REF!"}},{"$error":"#REF!"}]
[null,30,"711100030005","CORRECTOR LIQUIDO TIPO LAPICERO","UNIDAD",2.5,null,null,{"$f":"IF(B41=\"\",\"\",(#REF!+G41+H41+#REF!))","v":{"$error":"#REF!"}},{"$error":"#REF!"}]
[null,31,"715000110041","ENGRAPADOR CHICO DE OFICINA CON YUNQUE GIRATORIO","UNIDAD",19,null,null,{"$f":"IF(B42=\"\",\"\",(#REF!+G42+H42+#REF!))","v":{"$error":"#REF!"}},{"$error":"#REF!"}]
[null,32,"715000120010","PERFORADOR DE 2 ESPIGAS PARA 15 A 20 HOJAS","UNIDAD",7.7880000000000003,null,null,{"$f":"IF(B43=\"\",\"\",(#REF!+G43+H43+#REF!))","v":{"$error":"#REF!"}},{"$error":"#REF!"}]
[null,33,"715000140018","PORTA LAPICERO ACRILICO TIPO CUBO","UNIDAD",2.1358000000000001,null,null,{"$f":"IF(B44=\"\",\"\",(#REF!+G44+H44+#REF!))","v":{"$error":"#REF!"}},{"$f":"IF(F44=\"\",\"\",(F44*I44))","v":{"$error":"#REF!"}}]
[null,34,"715000190001","REGLA DE PLASTICO 30 cm","UNIDAD",0.9,null,null,{"$f":"IF(B45=\"\",\"\",(#REF!+G45+H45+#REF!))","v":{"$error":"#REF!"}},{"$error":"#REF!"}]
[null,35,"715000230050","TIJERA DE METAL DE 5 in CON PUNTA ROMA Y MANGO DE PLASTICO","UNIDAD",1.95,null,null,{"$f":"IF(B46=\"\",\"\",(#REF!+G46+H46+#REF!))","v":{"$error":"#REF!"}},{"$error":"#REF!"}]
[null,36,"715000320033","CUCHILLA PARA CORTAR PAPEL 10 mm","UNIDAD",1,null,null,{"$f":"IF(B47=\"\",\"\",(#REF!+G47+H47+#REF!))","v":{"$error":"#REF!"}},{"$error":"#REF!"}]
[null,37,"715000440001","MOTA PARA PIZARRA ACRILICA","UNIDAD",3,null,null,{"$f":"IF(B48=\"\",\"\",(#REF!+G48+H48+#REF!))","v":{"$error":"#REF!"}},{"$error":"#REF!"}]
[null,38,"716000010001","BOLIGRAFO (LAPICERO) DE TINTA LIQUIDA PUNTA FINA COLOR  NEGRO","UNIDAD",2.3954,null,null,{"$f":"IF(B49=\"\",\"\",(#REF!+G49+H49+#REF!))","v":{"$error":"#REF!"}},{"$error":"#REF!"}]
[null,39,"716000010002","BOLIGRAFO (LAPICERO) DE TINTA LIQUIDA PUNTA FINA COLOR  ROJO","UNIDAD",3.3,null,null,{"$f":"IF(B50=\"\",\"\",(#REF!+G50+H50+#REF!))","v":{"$error":"#REF!"}},{"$error":"#REF!"}]
[null,40,"716000010022","BOLIGRAFO (LAPICERO) DE TINTA LIQUIDA PUNTA FINA COLOR  AZUL","UNIDAD",3.3,null,null,{"$f":"IF(B51=\"\",\"\",(#REF!+G51+H51+#REF!))","v":{"$error":"#REF!"}},{"$error":"#REF!"}]
[null,41,"716000010212","BOLIGRAFO (LAPICERO) DE TINTA SECA PUNTA MEDIA COLOR  AZUL","UNIDAD",0.4,null,null,{"$f":"IF(B52=\"\",\"\",(#REF!+G52+H52+#REF!))","v":{"$error":"#REF!"}},{"$error":"#REF!"}]
[null,42,"716000010213","BOLIGRAFO (LAPICERO) DE TINTA SECA PUNTA MEDIA COLOR  NEGRO","UNIDAD",0.4,null,null,{"$f":"IF(B53=\"\",\"\",(#REF!+G53+H53+#REF!))","v":{"$error":"#REF!"}},{"$error":"#REF!"}]
[null,43,"716000010214","BOLIGRAFO (LAPICERO) DE TINTA SECA PUNTA MEDIA COLOR  ROJO","UNIDAD",0.4,null,null,{"$f":"IF(B54=\"\",\"\",(#REF!+G54+H54+#REF!))","v":{"$error":"#REF!"}},{"$error":"#REF!"}]
[null,44,"716000040070","LAPIZ GRAFITO Nº 2","UNIDAD",0.59,null,null,{"$f":"IF(B55=\"\",\"\",(#REF!+G55+H55+#REF!))","v":{"$error":"#REF!"}},{"$error":"#REF!"}]
[null,45,"716000060413","PLUMON MARCADOR DE TINTA AL AGUA PUNTA GRUESA COLOR NEGRO - PARA PAPEL","UNIDAD",2.5,null,null,{"$f":"IF(B56=\"\",\"\",(#REF!+G56+H56+#REF!))","v":{"$error":"#REF!"}},{"$error":"#REF!"}]
[null,46,"716000060414","PLUMON MARCADOR DE TINTA AL AGUA PUNTA GRUESA COLOR ROJO - PARA PAPEL","UNIDAD",2.5,null,null,{"$f":"IF(B57=\"\",\"\",(#REF!+G57+H57+#REF!))","v":{"$error":"#REF!"}},{"$error":"#REF!"}]
[null,47,"716000060415","PLUMON MARCADOR DE TINTA AL AGUA PUNTA GRUESA COLOR AZUL - PARA PAPEL","UNIDAD",2.5,null,null,{"$f":"IF(B58=\"\",\"\",(#REF!+G58+H58+#REF!))","v":{"$error":"#REF!"}},{"$error":"#REF!"}]
[null,48,"716000060443","PLUMON RESALTADOR PUNTA GRUESA BISELADA COLOR AMARILLO","UNIDAD",2.5,null,null,{"$f":"IF(B59=\"\",\"\",(#REF!+G59+H59+#REF!))","v":{"$error":"#REF!"}},{"$error":"#REF!"}]
[null,49,"716000060445","PLUMON RESALTADOR PUNTA GRUESA BISELADA VERDE","UNIDAD",2.5,null,null,{"$f":"IF(B60=\"\",\"\",(#REF!+G60+H60+#REF!))","v":{"$error":"#REF!"}},{"$error":"#REF!"}]
[null,50,"716000060540","PLUMON PARA PIZARRA ACRILICA PUNTA GRUESA RECARGABLE COLOR AZUL","UNIDAD",3.5,null,null,{"$f":"IF(B61=\"\",\"\",(#REF!+G61+H61+#REF!))","v":{"$error":"#REF!"}},{"$error":"#REF!"}]
[null,51,"716000060541","PLUMON PARA PIZARRA ACRILICA PUNTA GRUESA RECARGABLE COLOR ROJO","UNIDAD",3.5,null,null,{"$f":"IF(B62=\"\",\"\",(#REF!+G62+H62+#REF!))","v":{"$error":"#REF!"}},{"$error":"#REF!"}]
[null,52,"716000060542","PLUMON PARA PIZARRA ACRILICA PUNTA GRUESA RECARGABLE COLOR NEGRO","UNIDAD",3.5,null,null,{"$f":"IF(B63=\"\",\"\",(#REF!+G63+H63+#REF!))","v":{"$error":"#REF!"}},{"$error":"#REF!"}]
[null,53,"716000090066","TAMPON CON CUBIERTA DE PLASTICO 12.5 cm X 9.5 cm APROX. COLOR NEGRO","UNIDAD",2.5,null,null,{"$f":"IF(B64=\"\",\"\",(#REF!+G64+H64+#REF!))","v":{"$error":"#REF!"}},{"$error":"#REF!"}]
[null,54,"716000090064","TAMPON CON CUBIERTA DE PLASTICO 12.5 cm X 9.5 cm APROX. COLOR AZUL","UNIDAD",2.5,null,null,{"$f":"IF(B65=\"\",\"\",(#REF!+G65+H65+#REF!))","v":{"$error":"#REF!"}},{"$error":"#REF!"}]
[null,55,"716000160014","TINTA PARA TAMPON X 30 mL APROX. COLOR AZUL","UNIDAD",1.25,null,null,{"$f":"IF(B66=\"\",\"\",(#REF!+G66+H66+#REF!))","v":{"$error":"#REF!"}},{"$error":"#REF!"}]
[null,56,"716000160015","TINTA PARA TAMPON X 30 mL APROX. COLOR NEGRO","UNIDAD",1.25,null,null,{"$f":"IF(B67=\"\",\"\",(#REF!+G67+H67+#REF!))","v":{"$error":"#REF!"}},{"$error":"#REF!"}]
[null,57,"716000260013","TINTA PARA PLUMON DE PIZARRA ACRILICA X 27.5 mL COLOR AZUL","UNIDAD",8,null,null,{"$f":"IF(B68=\"\",\"\",(#REF!+G68+H68+#REF!))","v":{"$error":"#REF!"}},{"$error":"#REF!"}]
[null,null,"","","","",null,null,{"$f":"IF(B69=\"\",\"\",(#REF!+G69+H69+#REF!))","v":""},""]
[null,null,"","","","",null,null,{"$f":"IF(B70=\"\",\"\",(#REF!+G70+H70+#REF!))","v":""},""]
[null,null,"","","","",null,null,{"$f":"IF(B71=\"\",\"\",(#REF!+G71+H71+#REF!))","v":""},""]
[null,null,"","","","",null,null,{"$f":"IF(B72=\"\",\"\",(#REF!+G72+H72+#REF!))","v":""},""]
[null,null,"","","","",null,null,{"$f":"IF(B73=\"\",\"\",(#REF!+G73+H73+#REF!))","v":""},""]
[null,null,"","","","",null,null,{"$f":"IF(B74=\"\",\"\",(#REF!+G74+H74+#REF!))","v":""},""]
[null,null,"","","","",null,null,{"$f":"IF(B75=\"\",\"\",(#REF!+G75+H75+#REF!))","v":""},""]
[null,null,{"$f":"IF(B76=\"\",\"\",VLOOKUP(B76,CATALOGO,2,FALSE))","v":""},{"$f":"IF(B76=\"\",\"\",VLOOKUP(B76,CATALOGO,3,FALSE))","v":""},{"$f":"IF(B76=\"\",\"\",VLOOKUP(B76,CATALOGO,4,FALSE))","v":""},{"$f":"IF(B76=\"\",\"\",VLOOKUP(B76,CATALOGO,5,FALSE))","v":""},null,null,{"$f":"IF(B76=\"\",\"\",(#REF!+G76+H76+#REF!))","v":""},{"$f":"IF(F76=\"\",\"\",(F76*I76))","v":""}]
[null,null,"","","","",null,null,{"$f":"IF(B77=\"\",\"\",(#REF!+G77+H77+#REF!))","v":""},""]
[null,null,"","","","",null,null,{"$f":"IF(B78=\"\",\"\",(#REF!+G78+H78+#REF!))","v":""},""]
[null,null,"","","","",null,null,{"$f":"IF(B79=\"\",\"\",(#REF!+G79+H79+#REF!))","v":""},""]

{"sheet":"CATALOGO","index":3,"n_rows":81,"n_cols":7,"rows_kept":81,"cut":false,"hidden":false,"merged":[]}
["N°","CODIGO","NOMBRE DE ITEM","UNIDAD","PRECIO ESTIMADO","CLASIFICADOR"]
[1,"870100010001","SERVICIO DE AGUA POTABLE","SERVICIO"]
[2,"870100020003","SERVICIO DE ENERGIA ELECTRICA","SERVICIO",null,"2.3. 1 5. 3 1"]
[3,"133000270008","LIMPIA VIDRIO EN SPRAY X 1L","UNIDAD",6,"2.3. 1 5. 3 1"]
[4,"133000220009","KRESO X 1 L","UNIDAD",3.5,"2.3. 1 5. 3 1"]
[5,"135000050045","ESCOBA BAJA POLICIA DE 2 PITAS 2 ZUNCHOS","UNIDAD",7.5,"2.3. 1 5. 3 1"]
[6,"135000080025","ESCOBILLON DE CERDA PARA PISO X 30 cm","UNIDAD",6.8,"2.3. 1 5. 3 1"]
[7,"135000130006","RECOGEDOR DE PLASTICO TAMAÑO GRANDE","UNIDAD",5.9,"2.3. 1 5. 3 1"]
[8,"135000360004","GUANTE DE JEBE DE USO DOMESTICO TALLA 7","PAR",4.0199999999999996,"2.3. 1 5. 3 1"]
[9,"139200100117","JABON CARBOLICO EN BARRA X 200 g","UNIDAD",1,"2.3. 1 5. 3 1"]
[10,"646100030027","TACHO DE PLÁSTICO TIPO SANSON 100 L APROX.","UNIDAD",59.98,"2.3. 1 5. 3 1"]
[11,"646100030240","TACHO DE POLIETILENO PARA RECICLAJE DE BASURA 16 L APROX.","UNIDAD",18.5,"2.3. 1 5. 3 1"]
[12,"646100080005","ANTISARRO PARA WATER","UNIDAD",3.2,"2.3. 1 5. 3 1"]
[13,"895700081005","TELA FRANELA 1.00 m X 1.50 m","UNIDAD",5.5,"2.3. 1 5. 1 2"]
[14,"235200040014","JUEGO DE AJEDREZ","UNIDAD",15]
[15,"239400050007","NET PARA VOLEY","UNIDAD",54,"2.3. 1 3. 1 1"]
[16,"239400060013","PELOTA DE BASQUETBOL Nº 5","UNIDAD",39]
[17,"239400060042","PELOTA DE GOMA PARA BASQUETBOL N° 07","UNIDAD",45,"2.3. 1 9. 1 2"]
[18,"239400060034","PELOTA DE FUTSAL Nº 3.5","UNIDAD",52,"2.3. 1 9. 1 2"]
[19,"239400060067","PELOTA DE GOMA DE VOLEIBOL","UNIDAD",39,"2.3. 1 9. 1 2"]
[20,"239400060015","PELOTA DE FUTBOL N° 5","UNIDAD",49,"2.3. 1 9. 1 2"]
[21,"239400090220","CONO DE PLASTICO PARA ENTRENAMIENTO 30 cm","UNIDAD",3.8,"2.3. 1 9. 1 2"]
[22,"710300010010","CINTA ADHESIVA TRANSPARENTE 2 in X 72 yd","UNIDAD",3.2,"2.3. 1 9. 1 2"]
[23,"710300060057","GOMA EN BARRA X 40 g APROX.","UNIDAD",8,"2.3. 1 9. 1 2"]
[24,"710300160006","CINTA DE PAPEL PARA ENMASCARAR - MASKING TAPE 2 in X 40 yd","UNIDAD",1.77,"2.3. 1 9. 1 2"]
[25,"710600010012","ARCHIVADOR DE CARTON CON PALANCA LOMO ANCHO TAMAÑO OFICIO","UNIDAD",3.6579999999999999]
[26,"710600040024","FOLDER MANILA TAMAÑO  A4","EMPAQUE X 25",7.5,"2.3. 1 5. 1 2"]
[27,"710600060005","FORRO DE PLASTICO TAMAÑO OFICIO","UNIDAD",8.9,"2.3. 1 5. 1 2"]
[28,"710600100234","SOBRE MANILA TAMAÑO  A4","EMPAQUE X 50",8.673,"2.3. 1 5. 1 2"]
[29,"711100010008","BORRADOR MIXTO TAMAÑO GRANDE","UNIDAD",0.8,"2.3. 1 5. 1 2"]
[30,"711100030005","CORRECTOR LIQUIDO TIPO LAPICERO","UNIDAD",2.5,"2.3. 1 5. 1 2"]
[31,"715000110041","ENGRAPADOR CHICO DE OFICINA CON YUNQUE GIRATORIO","UNIDAD",19,"2.3. 1 5. 1 2"]
[32,"715000120010","PERFORADOR DE 2 ESPIGAS PARA 15 A 20 HOJAS","UNIDAD",7.7880000000000003,"2.3. 1 5. 1 2"]
[33,"715000140018","PORTA LAPICERO ACRILICO TIPO CUBO","UNIDAD",2.1358000000000001,"2.3. 1 5. 1 2"]
[34,"715000190001","REGLA DE PLASTICO 30 cm","UNIDAD",0.9,"2.3. 1 5. 1 2"]
[35,"715000230050","TIJERA DE METAL DE 5 in CON PUNTA ROMA Y MANGO DE PLASTICO","UNIDAD",1.95,"2.3. 1 5. 1 2"]
[36,"715000320033","CUCHILLA PARA CORTAR PAPEL 10 mm","UNIDAD",1,"2.3. 1 5. 1 2"]
[37,"715000440001","MOTA PARA PIZARRA ACRILICA","UNIDAD",3,"2.3. 1 5. 1 2"]
[38,"716000010001","BOLIGRAFO (LAPICERO) DE TINTA LIQUIDA PUNTA FINA COLOR  NEGRO","UNIDAD",2.3954,"2.3. 1 5. 1 2"]
[39,"716000010002","BOLIGRAFO (LAPICERO) DE TINTA LIQUIDA PUNTA FINA COLOR  ROJO","UNIDAD",3.3,"2.3. 1 5. 1 2"]
[40,"716000010022","BOLIGRAFO (LAPICERO) DE TINTA LIQUIDA PUNTA FINA COLOR  AZUL","UNIDAD",3.3,"2.3. 1 5. 1 2"]
[41,"716000010212","BOLIGRAFO (LAPICERO) DE TINTA SECA PUNTA MEDIA COLOR  AZUL","UNIDAD",0.4,"2.3. 1 5. 1 2"]
[42,"716000010213","BOLIGRAFO (LAPICERO) DE TINTA SECA PUNTA MEDIA COLOR  NEGRO","UNIDAD",0.4,"2.3. 1 5. 1 2"]
[43,"716000010214","BOLIGRAFO (LAPICERO) DE TINTA SECA PUNTA MEDIA COLOR  ROJO","UNIDAD",0.4,"2.3. 1 5. 1 2"]
[44,"716000040070","LAPIZ GRAFITO Nº 2","UNIDAD",0.59,"2.3. 1 5. 1 2"]
[45,"716000060413","PLUMON MARCADOR DE TINTA AL AGUA PUNTA GRUESA COLOR NEGRO - PARA PAPEL","UNIDAD",2.5,"2.3. 1 5. 1 2"]
[46,"716000060414","PLUMON MARCADOR DE TINTA AL AGUA PUNTA GRUESA COLOR ROJO - PARA PAPEL","UNIDAD",2.5,"2.3. 1 5. 1 2"]
[47,"716000060415","PLUMON MARCADOR DE TINTA AL AGUA PUNTA GRUESA COLOR AZUL - PARA PAPEL","UNIDAD",2.5,"2.3. 1 5. 1 2"]
[48,"716000060443","PLUMON RESALTADOR PUNTA GRUESA BISELADA COLOR AMARILLO","UNIDAD",2.5,"2.3. 1 5. 1 2"]
[49,"716000060445","PLUMON RESALTADOR PUNTA GRUESA BISELADA VERDE","UNIDAD",2.5,"2.3. 1 5. 1 2"]
[50,"716000060540","PLUMON PARA PIZARRA ACRILICA PUNTA GRUESA RECARGABLE COLOR AZUL","UNIDAD",3.5,"2.3. 1 5. 1 2"]
[51,"716000060541","PLUMON PARA PIZARRA ACRILICA PUNTA GRUESA RECARGABLE COLOR ROJO","UNIDAD",3.5,"2.3. 1 5. 1 2"]
[52,"716000060542","PLUMON PARA PIZARRA ACRILICA PUNTA GRUESA RECARGABLE COLOR NEGRO","UNIDAD",3.5,"2.3. 1 5. 1 2"]
[53,"716000090066","TAMPON CON CUBIERTA DE PLASTICO 12.5 cm X 9.5 cm APROX. COLOR NEGRO","UNIDAD",2.5,"2.3. 1 5. 1 2"]
[54,"716000090064","TAMPON CON CUBIERTA DE PLASTICO 12.5 cm X 9.5 cm APROX. COLOR AZUL","UNIDAD",2.5,"2.3. 1 5. 1 2"]
[55,"716000160014","TINTA PARA TAMPON X 30 mL APROX. COLOR AZUL","UNIDAD",1.25,"2.3. 1 5. 1 2"]
[56,"716000160015","TINTA PARA TAMPON X 30 mL APROX. COLOR NEGRO","UNIDAD",1.25,"2.3. 1 5. 1 2"]
[57,"716000260013","TINTA PARA PLUMON DE PIZARRA ACRILICA X 27.5 mL COLOR AZUL","UNIDAD",8,"2.3. 1 5. 1 2"]
[58,"716000260014","TINTA PARA PLUMON DE PIZARRA ACRILICA X 27.5 mL COLOR ROJO","UNIDAD",8,"2.3. 1 5. 1 2"]
[59,"716000260015","TINTA PARA PLUMON DE PIZARRA ACRILICA X 27.5 mL COLOR NEGRO","UNIDAD",8,"2.3. 1 5. 1 2"]
[60,"717200030014","CUADERNO CUADRICULADO TAMAÑO A4 X 100 HOJAS","UNIDAD",4.43,"2.3. 1 5. 1 2"]
[61,"717200030287","CUADERNO DOBLE ESPIRAL CUADRICULADO TAMAÑO A4 X 180 HOJAS","UNIDAD",7.25,"2.3. 1 5. 1 2"]
[62,"717200050227","PAPEL BOND 75 g  TAMAÑO A4","EMPAQUE X 500",10.33,"2.3. 1 5. 1 2"]
[63,"717200050413","PAPEL BOND 75 g TAMAÑO A4 DE COLORES","EMPAQUE X 500",30,"2.3. 1 5. 1 2"]
[64,"717200140152","LIBRO DE ACTAS EMPASTADO RAYADO TAMAÑO A4 X 100 HOJAS","UNIDAD",9.9,"2.3. 1 5. 1 2"]
[65,"717200150015","PAPEL CUADRICULADO 8 OFICIOS","UNIDAD",0.23,"2.3. 1 5. 1 2"]
[66,"718500050001","CLIP DE METAL CHICO Nº 1 X 100","UNIDAD",2.3954,"2.3. 1 5. 1 2"]
[67,"718500080026","GRAPA 26/6 X 5000","UNIDAD",1.85,"2.3. 1 5. 1 2"]
[68,"718500100017","SUJETADOR PARA PAPEL (TIPO FASTENER) DE METAL","EMPAQUE X 50",3.5,"2.3. 1 5. 1 2"]
[69,"767400040083","DISCO DVD - RW DE 4.7 GB","UNIDAD",0.55000000000000004,"2.3. 1 5. 1 2"]
[70,"767500590004","MEMORIA PORTATIL USB DE 8 GB","UNIDAD",20,"2.3. 1 5. 1 2"]
[71,"890400010045","CORROSPUN 1.00 m X 1.00 m - COLORES VARIOS","UNIDAD",8.9,"2.3. 1 5. 1 2"]
[72,null,null,null,null,"2.3. 1 5. 1 2"]
[73,null,null,null,null,"2.3. 1 5. 1 2"]
[74,null,null,null,null,"2.3. 1 5. 1 2"]
[75,null,null,null,null,"2.3. 1 5. 1 2"]
[76,null,null,null,null,"2.3. 1 5. 1 2"]
[77,null,null,null,null,"2.3. 1 5. 1 2"]
[78,null,null,null,null,"2.3. 1 5. 1 2"]
[79,null,null,null,null,"2.3. 1 5. 1 2"]
[80,null,null,null,null,"2.3. 1 5. 1 2","FIJARSE ITEMS NO EXISTE COLORES VARIOS"]

{"sheet":"Hoja1","index":4,"n_rows":409,"n_cols":41,"rows_kept":409,"cut":false,"hidden":true,"merged":[]}
["item_bien","nombre_item","unidad_medida","estado","grupo_bien","clase_bien","familia_bien","estado_mef","unidad_medida","ano_eje","sec_ejec","tipo_bien","precio_ref","unidad_medida","fecha_reg","estado","cuser_id","equipo_reg","indicador","fecha_ref","cuser_modif","flag_proc_cn","flag_check","cantidad_cn","cantidad_cn2","cantidad_cn3","precio_ref_origen","flag_activo","cant_unidad","nombre","unidad_adquis","flag_estado","unidad_adqu","precio_compra","fecha_compra","concate",null,"CODIGO","NOMBRE DE ITEM","UNIDAD","PRECIO ESTIMADO"]
["0014","REFRIGERIO",112,"A","09","79","0004","A",112,2016,1505,"B",8,112,"23/06/2015 02:34:42.186","A","02050907","A_SIGA","2","23/06/2015 02:34:42.186","02050907",null,"0",0,0,0,0,"N",0,"UNIDAD",112,null,"UNIDAD",0,null,{"$f":"CONCATENATE(E2,F2,G2,A2)","v":"097900040014"},null,{"$f":"+AJ2","v":"097900040014"},{"$f":"+B2","v":"REFRIGERIO"},{"$f":"+AG2","v":"UNIDAD"},{"$f":"+M2","v":8}]
[]
["0034","CERA AL AGUA PARA PISO COLOR ROJO",346,"A","13","30","0007","A",346,2016,1004,"B",27,346,"03/06/2015 10:58:38.11","A","04744514","A_SIGA","2","08/06/2015 14:53:26.64","01980772",null,"0",0,0,0,0,"N",0,"GALON",346,null,"GALON",0,null,{"$f":"CONCATENATE(E4,F4,G4,A4)","v":"133000070034"},null,{"$f":"+AJ4","v":"133000070034"},{"$f":"+B4","v":"CERA AL AGUA PARA PISO COLOR ROJO"},{"$f":"+AG4","v":"GALON"},{"$f":"+M4","v":27}]
["0037","CERA AL AGUA PARA PISO COLOR AMARILLO",346,"A","13","30","0007","A",346,2016,1004,"B",24,346,"03/06/2015 10:58:38.11","A","04744514","A_SIGA","2","08/06/2015 14:53:26.64","01980772",null,"0",0,0,0,0,"N",0,"GALON",346,null,"GALON",0,null,"133000070037",null,"133000070037","CERA AL AGUA PARA PISO COLOR AMARILLO","GALON",24]
["0043","CERA LIQUIDA PARA PISO COLOR ROJO",346,"A","13","30","0007","A",346,2016,1004,"B",24,346,"03/06/2015 10:58:38.11","A","04744514","A_SIGA","2","08/06/2015 14:53:26.64","01980772",null,"0",0,0,0,0,"N",0,"GALON",346,null,"GALON",0,null,"133000070043",null,"133000070043","CERA LIQUIDA PARA PISO COLOR ROJO","GALON",24]
["0032","CERA EN PASTA PARA PISO COLOR AMARILLO",346,"A","13","30","0008","A",346,2016,1004,"B",24,346,"03/06/2015 10:58:38.11","A","04744514","A_SIGA","2","08/06/2015 14:53:26.64","01980772",null,"0",0,0,0,0,"N",0,"GALON",346,null,"GALON",0,null,"133000080032",null,"133000080032","CERA EN PASTA PARA PISO COLOR AMARILLO","GALON",24]
["0033","CERA EN PASTA PARA PISO COLOR ROJO",346,"A","13","30","0008","A",346,2016,1004,"B",24,346,"03/06/2015 10:58:38.11","A","04744514","A_SIGA","2","08/06/2015 14:53:26.64","01980772",null,"0",0,0,0,0,"N",0,"GALON",346,null,"GALON",0,null,"133000080033",null,"133000080033","CERA EN PASTA PARA PISO COLOR ROJO","GALON",24]
["0077","AMBIENTADOR EN SPRAY X 400 mL APROX.",112,"A","13","30","0014","A",112,2016,1505,"B",9,112,"04/06/2015 21:59:24.516","A","02050907","A_SIGA","2","04/06/2015 21:59:24.516","02050907",null,"0",0,0,0,0,"N",0,"UNIDAD",112,null,"UNIDAD",0,null,"133000140077",null,"133000140077","AMBIENTADOR EN SPRAY X 400 mL APROX.","UNIDAD",9]
["0001","KRESO",349,"A","13","30","0022","A",349,2016,1004,"B",3.2,349,"08/06/2015 09:09:46.343","A","01980772","ESCAL1","2","08/06/2015 14:53:26.64","01980772",null,"0",0,0,0,0,"N",0,"LITRO",349,null,"LITRO",null,null,"133000220001",null,"133000220001","KRESO","LITRO",3.2]
["0009","KRESO X 1 L",112,"A","13","30","0022","A",112,2016,1505,"B",4,112,"04/06/2015 21:59:24.516","A","02050907","A_SIGA","2","08/06/2015 02:32:33.403","02050907",null,"0",0,0,0,0,"N",0,"UNIDAD",112,null,"UNIDAD",0,null,"133000220009",null,"133000220009","KRESO X 1 L","UNIDAD",4]
["0010","KRESO X 1 gal",112,"A","13","30","0022","A",112,2016,1505,"B",3.9,112,"17/06/2015 20:52:28.193","A","02050907","A_SIGA","2","21/06/2015 21:57:51.323","02050907",null,"0",0,0,0,0,"N",0,"UNIDAD",112,null,"UNIDAD",0,null,"133000220010",null,"133000220010","KRESO X 1 gal","UNIDAD",3.9]
["0045","ESCOBA BAJA POLICIA DE 2 PITAS 2 ZUNCHOS",112,"A","13","50","0005","A",112,2016,1505,"B",10,112,"04/06/2015 21:59:24.516","A","02050907","A_SIGA","2","08/06/2015 02:32:33.403","02050907",null,"0",0,0,0,0,"N",0,"UNIDAD",112,null,"UNIDAD",0,null,"135000050045",null,"135000050045","ESCOBA BAJA POLICIA DE 2 PITAS 2 ZUNCHOS","UNIDAD",10]
["0047","ESCOBA DE NAILON 2 HILERAS",112,"A","13","50","0005","A",112,2016,1004,"B",5.8,112,"03/06/2015 10:58:38.11","A","04744514","A_SIGA","2","08/06/2015 14:53:26.64","01980772",null,"0",0,0,0,0,"N",0,"UNIDAD",112,null,"UNIDAD",0,null,"135000050047",null,"135000050047","ESCOBA DE NAILON 2 HILERAS","UNIDAD",5.8]
["0126","ESCOBILLA CIRCULAR DE NAILON PARA INODORO",112,"A","13","50","0006","A",112,2016,1004,"B",2.5,112,"03/06/2015 10:58:38.11","A","04744514","A_SIGA","2","08/06/2015 14:53:26.64","01980772",null,"0",0,0,0,0,"N",0,"UNIDAD",112,null,"UNIDAD",0,null,"135000060126",null,"135000060126","ESCOBILLA CIRCULAR DE NAILON PARA INODORO","UNIDAD",2.5]
["0025","ESCOBILLON DE CERDA PARA PISO X 30 cm",112,"A","13","50","0008","A",112,2016,1505,"B",9,112,"04/06/2015 21:59:24.516","A","02050907","A_SIGA","2","08/06/2015 02:32:33.403","02050907",null,"0",0,0,0,0,"N",0,"UNIDAD",112,null,"UNIDAD",0,null,"135000080025",null,"135000080025","ESCOBILLON DE CERDA PARA PISO X 30 cm","UNIDAD",9]
["0079","ESCOBILLON DE CERDA PLASTICA DE 90 cm",112,"A","13","50","0008","A",112,2016,1505,"B",9,112,"17/06/2015 20:52:28.193","A","02050907","A_SIGA","2","18/06/2015 20:51:35.89","02050907",null,"0",0,0,0,0,"N",0,"UNIDAD",112,null,"UNIDAD",0,null,"135000080079",null,"135000080079","ESCOBILLON DE CERDA PLASTICA DE 90 cm","UNIDAD",9]
["0039","ESPONJA DE ESPUMA SINTETICA",112,"A","13","50","0009","A",112,2016,1004,"B",3.1269999999999998,112,"18/06/2015 10:00:33.72","A","04744514","A_SIGA","2","18/06/2015 10:00:33.72","04744514",null,"0",0,0,0,0,"N",0,"UNIDAD",112,null,"UNIDAD",0,null,"135000090039",null,"135000090039","ESPONJA DE ESPUMA SINTETICA","UNIDAD",3.1269999999999998]
["0006","RECOGEDOR DE PLASTICO TAMAÑO GRANDE",112,"A","13","50","0013","A",112,2016,1505,"B",5.9,112,"04/06/2015 21:59:24.516","A","02050907","A_SIGA","2","08/06/2015 02:32:33.403","02050907",null,"0",0,0,0,0,"N",0,"UNIDAD",112,null,"UNIDAD",null,null,"135000130006",null,"135000130006","RECOGEDOR DE PLASTICO TAMAÑO GRANDE","UNIDAD",5.9]
["0007","RECOGEDOR DE PLASTICO TAMAÑO MEDIANO",112,"A","13","50","0013","A",112,2016,1004,"B",6.68,112,"04/06/2015 15:07:32.983","A","01980772","ESCAL1","2","08/06/2015 14:53:26.64","01980772",null,"0",0,0,0,0,"N",0,"UNIDAD",112,null,"UNIDAD",null,null,"135000130007",null,"135000130007","RECOGEDOR DE PLASTICO TAMAÑO MEDIANO","UNIDAD",6.68]
["0136","HISOPO DE PLASTICO PARA LIMPIAR BAÑO",112,"A","13","50","0019","A",112,2016,1505,"B",3,112,"17/06/2015 20:52:28.193","A","02050907","A_SIGA","2","18/06/2015 20:51:35.89","02050907",null,"0",0,0,0,0,"N",0,"UNIDAD",112,null,"UNIDAD",0,null,"135000190136",null,"135000190136","HISOPO DE PLASTICO PARA LIMPIAR BAÑO","UNIDAD",3]
["0004","GUANTE DE JEBE DE USO DOMESTICO TALLA 7",353,"A","13","50","0036","A",353,2016,1004,"B",4.0199999999999996,353,"03/06/2015 10:58:38.11","A","04744514","A_SIGA","2","08/06/2015 14:53:26.64","01980772",null,"0",0,0,0,0,"N",0,"PAR",353,null,"PAR",0,null,"135000360004",null,"135000360004","GUANTE DE JEBE DE USO DOMESTICO TALLA 7","PAR",4.0199999999999996]
["0049","JABON DE TOCADOR EN BARRA X 100 g",112,"A","13","92","0010","A",112,2016,1004,"B",2.2000000000000002,112,"23/06/2015 10:34:13.983","A","04744514","A_SIGA","2","23/06/2015 10:34:13.983","04744514",null,"0",0,0,0,0,"N",0,"UNIDAD",112,null,"UNIDAD",0,null,"139200100049",null,"139200100049","JABON DE TOCADOR EN BARRA X 100 g","UNIDAD",2.2000000000000002]
["0096","JABON DE TOCADOR LIQUIDO X 400 mL",112,"A","13","92","0010","A",112,2016,1505,"B",4.5,112,"04/06/2015 21:59:24.516","A","02050907","A_SIGA","2","08/06/2015 02:32:33.403","02050907",null,"0",0,0,0,0,"N",0,"UNIDAD",112,null,"UNIDAD",0,null,"139200100096",null,"139200100096","JABON DE TOCADOR LIQUIDO X 400 mL","UNIDAD",4.5]
["0116","JABON CARBOLICO EN BARRA X 100 g",112,"A","13","92","0010","A",112,2016,1004,"B",1.2,112,"03/06/2015 10:58:38.11","A","04744514","A_SIGA","2","08/06/2015 14:53:26.64","01980772",null,"0",0,0,0,0,"N",0,"UNIDAD",112,null,"UNIDAD",0,null,"139200100116",null,"139200100116","JABON CARBOLICO EN BARRA X 100 g","UNIDAD",1.2]
["0117","JABON CARBOLICO EN BARRA X 200 g",112,"A","13","92","0010","A",112,2016,1004,"B",2.2000000000000002,112,"03/06/2015 10:58:38.11","A","04744514","A_SIGA","2","08/06/2015 14:53:26.64","01980772",null,"0",0,0,0,0,"N",0,"UNIDAD",112,null,"UNIDAD",0,null,"139200100117",null,"139200100117","JABON CARBOLICO EN BARRA X 200 g","UNIDAD",2.2000000000000002]
[]
["2625","LIBRO VOCES DE NUESTRA TIERRA.",112,"A","14","03","0001","A",112,2016,1004,"B",1.5979159999999999,112,"23/06/2015 10:34:13.983","A","04744514","A_SIGA","2","23/06/2015 10:34:13.983","04744514",null,"0",0,0,0,0,"S",0,"UNIDAD",112,null,"UNIDAD",0,null,{"$f":"CONCATENATE(E28,F28,G28,A28)","v":"140300012625"},null,"140300012625","LIBRO VOCES DE NUESTRA TIERRA.","UNIDAD",1.5979159999999999]
["9833","LIBRO COMO PRODUCIR LECHE DE OPTIMA CALIDAD",112,"A","14","03","0001","A",112,2016,1004,"B",0.85507900000000003,112,"23/06/2015 10:34:13.983","A","04744514","A_SIGA","2","23/06/2015 10:34:13.983","04744514",null,"0",0,0,0,0,"S",0,"UNIDAD",112,null,"UNIDAD",0,null,"140300019833",null,"140300019833","LIBRO COMO PRODUCIR LECHE DE OPTIMA CALIDAD","UNIDAD",0.85507900000000003]
["1885","LIBRO PERÚ PAÍS MARAVILLOSO: MANUAL DE EDUCACIÓN AMBIENTAL PARA DOCENTES",112,"A","14","03","0024","A",112,2016,1004,"B",5.1087639999999999,112,"23/06/2015 10:34:13.983","A","04744514","A_SIGA","2","23/06/2015 10:34:13.983","04744514",null,"0",0,0,0,0,"S",0,"UNIDAD",112,null,"UNIDAD",0,null,"140300241885",null,"140300241885","LIBRO PERÚ PAÍS MARAVILLOSO: MANUAL DE EDUCACIÓN AMBIENTAL PARA DOCENTES","UNIDAD",5.1087639999999999]
["1886","LIBRO LENGUA DE SEÑAS PERUANAS",112,"A","14","03","0024","A",112,2016,1004,"B",5.1087639999999999,112,"23/06/2015 10:34:13.983","A","04744514","A_SIGA","2","23/06/2015 10:34:13.983","04744514",null,"0",0,0,0,0,"S",0,"UNIDAD",112,null,"UNIDAD",0,null,"140300241886",null,"140300241886","LIBRO LENGUA DE SEÑAS PERUANAS","UNIDAD",5.1087639999999999]
["1887","LIBRO CALENDARIO DE FESTIVIDADES DEL PERÚ",112,"A","14","03","0024","A",112,2016,1004,"B",5.1087639999999999,112,"23/06/2015 10:34:13.983","A","04744514","A_SIGA","2","23/06/2015 10:34:13.983","04744514",null,"0",0,0,0,0,"S",0,"UNIDAD",112,null,"UNIDAD",0,null,"140300241887",null,"140300241887","LIBRO CALENDARIO DE FESTIVIDADES DEL PERÚ","UNIDAD",5.1087639999999999]
["1888","LIBRO CONVENCIÓN SOBRE LOS DERECHOS DE LOS NIÑOS",112,"A","14","03","0024","A",112,2016,1004,"B",5.1087639999999999,112,"23/06/2015 10:34:13.983","A","04744514","A_SIGA","2","23/06/2015 10:34:13.983","04744514",null,"0",0,0,0,0,"S",0,"UNIDAD",112,null,"UNIDAD",0,null,"140300241888",null,"140300241888","LIBRO CONVENCIÓN SOBRE LOS DERECHOS DE LOS NIÑOS","UNIDAD",5.1087639999999999]
["1889","LIBRO CONCURSO JOSÉ MARÍA ARGUEDAS 2009",112,"A","14","03","0024","A",112,2016,1004,"B",1.5979159999999999,112,"23/06/2015 10:34:13.983","A","04744514","A_SIGA","2","23/06/2015 10:34:13.983","04744514",null,"0",0,0,0,0,"S",0,"UNIDAD",112,null,"UNIDAD",0,null,"140300241889",null,"140300241889","LIBRO CONCURSO JOSÉ MARÍA ARGUEDAS 2009","UNIDAD",1.5979159999999999]
["1890","LIBRO CONCURSO JOSÉ MARÍA ARGUEDAS 2010",112,"A","14","03","0024","A",112,2016,1004,"B",1.5979159999999999,112,"23/06/2015 10:34:13.983","A","04744514","A_SIGA","2","23/06/2015 10:34:13.983","04744514",null,"0",0,0,0,0,"S",0,"UNIDAD",112,null,"UNIDAD",0,null,"140300241890",null,"140300241890","LIBRO CONCURSO JOSÉ MARÍA ARGUEDAS 2010","UNIDAD",1.5979159999999999]
["1891","LIBRO DORITA Y SUS AMIGOS",112,"A","14","03","0024","A",112,2016,1004,"B",1.5979159999999999,112,"23/06/2015 10:34:13.983","A","04744514","A_SIGA","2","23/06/2015 10:34:13.983","04744514",null,"0",0,0,0,0,"S",0,"UNIDAD",112,null,"UNIDAD",0,null,"140300241891",null,"140300241891","LIBRO DORITA Y SUS AMIGOS","UNIDAD",1.5979159999999999]
["1892","LIBRO UNA HERMOSA EXPERIENCIA",112,"A","14","03","0024","A",112,2016,1004,"B",1.5979159999999999,112,"23/06/2015 10:34:13.983","A","04744514","A_SIGA","2","23/06/2015 10:34:13.983","04744514",null,"0",0,0,0,0,"S",0,"UNIDAD",112,null,"UNIDAD",0,null,"140300241892",null,"140300241892","LIBRO UNA HERMOSA EXPERIENCIA","UNIDAD",1.5979159999999999]
["1893","LIBRO PEPÍN EL NIÑO JUGUETÓN",112,"A","14","03","0024","A",112,2016,1004,"B",1.5979159999999999,112,"23/06/2015 10:34:13.983","A","04744514","A_SIGA","2","23/06/2015 10:34:13.983","04744514",null,"0",0,0,0,0,"S",0,"UNIDAD",112,null,"UNIDAD",0,null,"140300241893",null,"140300241893","LIBRO PEPÍN EL NIÑO JUGUETÓN","UNIDAD",1.5979159999999999]
["1894","LIBRO LA ILUSIÓN DE MARÍA",112,"A","14","03","0024","A",112,2016,1004,"B",1.5979159999999999,112,"23/06/2015 10:34:13.983","A","04744514","A_SIGA","2","23/06/2015 10:34:13.983","04744514",null,"0",0,0,0,0,"S",0,"UNIDAD",112,null,"UNIDAD",0,null,"140300241894",null,"140300241894","LIBRO LA ILUSIÓN DE MARÍA","UNIDAD",1.5979159999999999]
["1895","LIBRO LA HISTORIA DE FRANCISCA",112,"A","14","03","0024","A",112,2016,1004,"B",1.5979159999999999,112,"23/06/2015 10:34:13.983","A","04744514","A_SIGA","2","23/06/2015 10:34:13.983","04744514",null,"0",0,0,0,0,"S",0,"UNIDAD",112,null,"UNIDAD",0,null,"140300241895",null,"140300241895","LIBRO LA HISTORIA DE FRANCISCA","UNIDAD",1.5979159999999999]
["1896","LIBRO DIEZ MARIPOSAS",112,"A","14","03","0024","A",112,2016,1004,"B",1.5979159999999999,112,"23/06/2015 10:34:13.983","A","04744514","A_SIGA","2","23/06/2015 10:34:13.983","04744514",null,"0",0,0,0,0,"S",0,"UNIDAD",112,null,"UNIDAD",0,null,"140300241896",null,"140300241896","LIBRO DIEZ MARIPOSAS","UNIDAD",1.5979159999999999]
["1897","LIBRO LA ESCUELA QUE QUEREMOS. ESTUDIANTES QUE OPINAN SOBRE EL PROYECTO EDUCATIVO NACIONAL AL 2021",112,"A","14","03","0024","A",112,2016,1004,"B",1.5979159999999999,112,"23/06/2015 10:34:13.983","A","04744514","A_SIGA","2","23/06/2015 10:34:13.983","04744514",null,"0",0,0,0,0,"S",0,"UNIDAD",112,null,"UNIDAD",0,null,"140300241897",null,"140300241897","LIBRO LA ESCUELA QUE QUEREMOS. ESTUDIANTES QUE OPINAN SOBRE EL PROYECTO EDUCATIVO NACIONAL AL 2021","UNIDAD",1.5979159999999999]
["1898","LIBRO CONCURSO NACIONAL DE LITERATURA",112,"A","14","03","0024","A",112,2016,1004,"B",1.5979159999999999,112,"23/06/2015 10:34:13.983","A","04744514","A_SIGA","2","23/06/2015 10:34:13.983","04744514",null,"0",0,0,0,0,"S",0,"UNIDAD",112,null,"UNIDAD",0,null,"140300241898",null,"140300241898","LIBRO CONCURSO NACIONAL DE LITERATURA","UNIDAD",1.5979159999999999]
["1899","LIBRO TRADICIONES CUZQUEÑAS PARA NIÑOS",112,"A","14","03","0024","A",112,2016,1004,"B",1.5979159999999999,112,"23/06/2015 10:34:13.983","A","04744514","A_SIGA","2","23/06/2015 10:34:13.983","04744514",null,"0",0,0,0,0,"S",0,"UNIDAD",112,null,"UNIDAD",0,null,"140300241899",null,"140300241899","LIBRO TRADICIONES CUZQUEÑAS PARA NIÑOS","UNIDAD",1.5979159999999999]
["1905","LIBRO TRES HISTORIAS DE LA VIDA REAL - SER CIUDADANO ES NUESTRO DERECHO",112,"A","14","03","0024","A",112,2016,1004,"B",0.85507900000000003,112,"23/06/2015 10:34:13.983","A","04744514","A_SIGA","2","23/06/2015 10:34:13.983","04744514",null,"0",0,0,0,0,"S",0,"UNIDAD",112,null,"UNIDAD",0,null,"140300241905",null,"140300241905","LIBRO TRES HISTORIAS DE LA VIDA REAL - SER CIUDADANO ES NUESTRO DERECHO","UNIDAD",0.85507900000000003]
["1906","LIBRO QUÉ PASOS DEBES SEGUIR PARA OBTENER TU DNI?- PONLE TU NOMBRE A TU DNI",112,"A","14","03","0024","A",112,2016,1004,"B",0.85507900000000003,112,"23/06/2015 10:34:13.983","A","04744514","A_SIGA","2","23/06/2015 10:34:13.983","04744514",null,"0",0,0,0,0,"S",0,"UNIDAD",112,null,"UNIDAD",0,null,"140300241906",null,"140300241906","LIBRO QUÉ PASOS DEBES SEGUIR PARA OBTENER TU DNI?- PONLE TU NOMBRE A TU DNI","UNIDAD",0.85507900000000003]
["1907","LIBRO DERECHOS DE AUTOR",112,"A","14","03","0024","A",112,2016,1004,"B",0.85507900000000003,112,"23/06/2015 10:34:13.983","A","04744514","A_SIGA","2","23/06/2015 10:34:13.983","04744514",null,"0",0,0,0,0,"S",0,"UNIDAD",112,null,"UNIDAD",0,null,"140300241907",null,"140300241907","LIBRO DERECHOS DE AUTOR","UNIDAD",0.85507900000000003]
["1908","LIBRO MARCAS",112,"A","14","03","0024","A",112,2016,1004,"B",0.85507900000000003,112,"23/06/2015 10:34:13.983","A","04744514","A_SIGA","2","23/06/2015 10:34:13.983","04744514",null,"0",0,0,0,0,"S",0,"UNIDAD",112,null,"UNIDAD",0,null,"140300241908",null,"140300241908","LIBRO MARCAS","UNIDAD",0.85507900000000003]
["1909","LIBRO PATENTES",112,"A","14","03","0024","A",112,2016,1004,"B",0.85507900000000003,112,"23/06/2015 10:34:13.983","A","04744514","A_SIGA","2","23/06/2015 10:34:13.983","04744514",null,"0",0,0,0,0,"S",0,"UNIDAD",112,null,"UNIDAD",0,null,"140300241909",null,"140300241909","LIBRO PATENTES","UNIDAD",0.85507900000000003]
["1910","LIBRO SEIS OBJETIVOS PARA LA ACCIÓN - PROYECTO EDUCATIVO NACIONAL",112,"A","14","03","0024","A",112,2016,1004,"B",0.85507900000000003,112,"23/06/2015 10:34:13.983","A","04744514","A_SIGA","2","23/06/2015 10:34:13.983","04744514",null,"0",0,0,0,0,"S",0,"UNIDAD",112,null,"UNIDAD",0,null,"140300241910",null,"140300241910","LIBRO SEIS OBJETIVOS PARA LA ACCIÓN - PROYECTO EDUCATIVO NACIONAL","UNIDAD",0.85507900000000003]
["1911","LIBRO BIODIVERSIDAD",112,"A","14","03","0024","A",112,2016,1004,"B",0.85508300000000004,112,"23/06/2015 10:34:13.983","A","04744514","A_SIGA","2","23/06/2015 10:34:13.983","04744514",null,"0",0,0,0,0,"S",0,"UNIDAD",112,null,"UNIDAD",0,null,"140300241911",null,"140300241911","LIBRO BIODIVERSIDAD","UNIDAD",0.85508300000000004]
["1912","LIBRO EL GAS NATURAL",112,"A","14","03","0024","A",112,2016,1004,"B",0.85507900000000003,112,"23/06/2015 10:34:13.983","A","04744514","A_SIGA","2","23/06/2015 10:34:13.983","04744514",null,"0",0,0,0,0,"S",0,"UNIDAD",112,null,"UNIDAD",0,null,"140300241912",null,"140300241912","LIBRO EL GAS NATURAL","UNIDAD",0.85507900000000003]
[]
["0020","DIESEL B5 S50",346,"A","17","21","0007","A",346,2016,1505,"B",13,346,"04/06/2015 21:59:24.516","A","02050907","A_SIGA","2","08/06/2015 02:32:33.403","02050907",null,"0",0,0,0,0,"N",0,"GALON",346,null,"GALON",0,null,{"$f":"CONCATENATE(E54,F54,G54,A54)","v":"172100070020"},null,"172100070020","DIESEL B5 S50","GALON",13]
["0006","GASOHOL 84 PLUS",346,"A","17","21","0008","A",346,2016,1505,"B",13.5,346,"04/06/2015 21:59:24.516","A","02050907","A_SIGA","2","08/06/2015 02:32:33.403","02050907",null,"0",0,0,0,0,"N",0,"GALON",346,null,"GALON",0,null,"172100080006",null,"172100080006","GASOHOL 84 PLUS","GALON",13.5]
["0326","ACEITE LUBRICANTE MULTIGRADO SAE 20W-50º PARA MOTOR GASOLINERO X 1/4 gal",112,"A","17","55","0010","A",112,2016,1505,"B",22,112,"04/06/2015 21:59:24.516","A","02050907","A_SIGA","2","21/06/2015 21:57:51.323","02050907",null,"0",0,0,0,0,"N",0,"UNIDAD",112,null,"UNIDAD",0,null,"175500100326",null,"175500100326","ACEITE LUBRICANTE MULTIGRADO SAE 20W-50º PARA MOTOR GASOLINERO X 1/4 gal","UNIDAD",22]
["0330","ACEITE LUBRICANTE MULTIGRADO SAE 25W-50º PARA MOTOR PETROLERO X 1 gal",112,"A","17","55","0010","A",112,2016,1505,"B",18,112,"04/06/2015 21:59:24.516","A","02050907","A_SIGA","2","21/06/2015 21:57:51.323","02050907",null,"0",0,0,0,0,"N",0,"UNIDAD",112,null,"UNIDAD",0,null,"175500100330",null,"175500100330","ACEITE LUBRICANTE MULTIGRADO SAE 25W-50º PARA MOTOR PETROLERO X 1 gal","UNIDAD",18]
["0002","GRASA PARA PALIER",112,"A","17","55","0014","A",112,2016,1004,"B",0.9,112,"03/06/2015 13:59:54.716","A","01980772","ESCAL1","2","08/06/2015 14:53:26.64","01980772",null,"0",0,0,0,9,"N",0,"UNIDAD",112,null,"UNIDAD",null,null,"175500140002",null,"175500140002","GRASA PARA PALIER","UNIDAD",0.9]
["0038","GRASA PARA VEHICULOS (ROJA)",128,"A","17","55","0014","A",128,2016,1004,"B",8,128,"03/06/2015 10:58:38.11","A","04744514","A_SIGA","2","08/06/2015 14:53:26.64","01980772",null,"0",0,0,0,0,"N",0,"KILOGRAMO",128,null,"KILOGRAMO",0,null,"175500140038",null,"175500140038","GRASA PARA VEHICULOS (ROJA)","KILOGRAMO",8]
[]
["0025","PAPEL TERMICO PARA FACSIMIL 205 mm X 30 m",112,"A","19","91","0004","A",112,2016,1004,"B",5,112,"23/06/2015 10:34:13.983","A","04744514","A_SIGA","2","23/06/2015 10:34:13.983","04744514",null,"0",0,0,0,0,"N",0,"UNIDAD",112,null,"UNIDAD",0,null,{"$f":"CONCATENATE(E61,F61,G61,A61)","v":"199100040025"},null,"199100040025","PAPEL TERMICO PARA FACSIMIL 205 mm X 30 m","UNIDAD",5]
[]
["0014","JUEGO DE AJEDREZ",112,"A","23","52","0004","A",112,2016,1004,"B",6.48,112,"23/06/2015 10:34:13.983","A","04744514","A_SIGA","2","23/06/2015 10:34:13.983","04744514",null,"0",0,0,0,0,"N",0,"UNIDAD",112,null,"UNIDAD",0,null,{"$f":"CONCATENATE(E63,F63,G63,A63)","v":"235200040014"},null,"235200040014","JUEGO DE AJEDREZ","UNIDAD",6.48]
["0007","NET PARA VOLEY",112,"A","23","94","0005","A",112,2016,1004,"B",54,112,"03/06/2015 15:28:35.876","A","01980772","ESCAL1","2","08/06/2015 14:53:26.64","01980772",null,"0",0,0,0,0,"N",0,"UNIDAD",112,null,"UNIDAD",0,null,"239400050007",null,"239400050007","NET PARA VOLEY","UNIDAD",54]
["0013","PELOTA DE BASQUETBOL Nº 5",112,"A","23","94","0006","A",112,2016,1505,"B",39,112,"04/06/2015 21:59:24.516","A","02050907","A_SIGA","2","08/06/2015 02:32:33.403","02050907",null,"0",0,0,0,0,"N",0,"UNIDAD",112,null,"UNIDAD",0,null,"239400060013",null,"239400060013","PELOTA DE BASQUETBOL Nº 5","UNIDAD",39]
["0050","PELOTA DE FUTSAL Nº 04",112,"A","23","94","0006","A",112,2016,1505,"B",48,112,"17/06/2015 20:52:28.193","A","02050907","A_SIGA","2","18/06/2015 20:51:35.89","02050907",null,"0",0,0,0,0,"N",0,"UNIDAD",112,null,"UNIDAD",0,null,"239400060050",null,"239400060050","PELOTA DE FUTSAL Nº 04","UNIDAD",48]
["0068","PELOTA DE CUERO DE VOLEIBOL",112,"A","23","94","0006","A",112,2016,1505,"B",39,112,"04/06/2015 21:59:24.516","A","02050907","A_SIGA","2","08/06/2015 02:32:33.403","02050907",null,"0",0,0,0,0,"N",0,"UNIDAD",112,null,"UNIDAD",0,null,"239400060068",null,{"$f":"+AJ67","v":"239400060068"},{"$f":"+B67","v":"PELOTA DE CUERO DE VOLEIBOL"},{"$f":"+AG67","v":"UNIDAD"},{"$f":"+M67","v":39}]
["0070","PELOTA DE CUERO DE FUTBOL",112,"A","23","94","0006","A",112,2016,1505,"B",49,112,"04/06/2015 21:59:24.516","A","02050907","A_SIGA","2","08/06/2015 02:32:33.403","02050907",null,"0",0,0,0,0,"N",0,"UNIDAD",112,null,"UNIDAD",0,null,"239400060070",null,"239400060070","PELOTA DE CUERO DE FUTBOL","UNIDAD",49]
["0116","BALA DE ATLETISMO PARA ENTRENAMIENTO (SIN PESO REGLAMENTARIO)",112,"A","23","94","0009","A",112,2016,1004,"B",65,112,"23/06/2015 10:34:13.983","A","04744514","A_SIGA","2","23/06/2015 10:34:13.983","04744514",null,"0",0,0,0,0,"N",0,"UNIDAD",112,null,"UNIDAD",0,null,"239400090116",null,"239400090116","BALA DE ATLETISMO PARA ENTRENAMIENTO (SIN PESO REGLAMENTARIO)","UNIDAD",65]
[]
["0806","SUPRESOR DE PICO DE 6 TOMAS 220 V",112,"A","28","34","0009","A",112,2016,1004,"B",17,112,"04/06/2015 15:07:32.983","A","01980772","ESCAL1","2","08/06/2015 14:53:26.64","01980772",null,"0",0,0,0,0,"N",0,"UNIDAD",112,null,"UNIDAD",0,null,{"$f":"CONCATENATE(E71,F71,G71,A71)","v":"283400090806"},null,"283400090806","SUPRESOR DE PICO DE 6 TOMAS 220 V","UNIDAD",17]
["0056","ESCUADRA DE MADERA DE 90º X 60 cm",112,"A","29","05","0006","A",112,2016,1004,"B",55,112,"03/06/2015 10:58:38.11","A","04744514","A_SIGA","2","08/06/2015 14:53:26.64","01980772",null,"0",0,0,0,0,"N",0,"UNIDAD",112,null,"UNIDAD",0,null,"290500060056",null,"290500060056","ESCUADRA DE MADERA DE 90º X 60 cm","UNIDAD",55]
["0082","JUEGO DE ESCUADRAS DE PLASTICO X 4 PIEZAS",112,"A","29","05","0006","A",112,2016,1004,"B",1.8,112,"23/06/2015 10:34:13.983","A","04744514","A_SIGA","2","23/06/2015 10:34:13.983","04744514",null,"0",0,0,0,0,"N",0,"UNIDAD",112,null,"UNIDAD",0,null,"290500060082",null,"290500060082","JUEGO DE ESCUADRAS DE PLASTICO X 4 PIEZAS","UNIDAD",1.8]
["0027","SILICONA LIQUIDA PARA MANUALIDADES X 250 mL",112,"A","29","10","0002","A",112,2016,1004,"B",3.8,112,"04/06/2015 15:07:32.983","A","01980772","ESCAL1","2","08/06/2015 14:53:26.64","01980772",null,"0",0,0,0,0,"N",0,"UNIDAD",112,null,"UNIDAD",0,null,"291000020027",null,"291000020027","SILICONA LIQUIDA PARA MANUALIDADES X 250 mL","UNIDAD",3.8]
["0013","TEMPERA X 10 g APROX. JUEGO X 7 COLORES",112,"A","29","10","0010","A",112,2016,1004,"B",7,112,"04/06/2015 15:07:32.983","A","01980772","ESCAL1","2","08/06/2015 14:53:26.64","01980772",null,"0",0,0,0,0,"N",0,"UNIDAD",112,null,"UNIDAD",0,null,"291000100013",null,"291000100013","TEMPERA X 10 g APROX. JUEGO X 7 COLORES","UNIDAD",7]
["0055","TEMPERA CON APLICADOR X 250 mL COLOR AZUL",112,"A","29","10","0010","A",112,2016,1004,"B",4.4000000000000004,112,"23/06/2015 10:34:13.983","A","04744514","A_SIGA","2","23/06/2015 10:34:13.983","04744514",null,"0",0,0,0,0,"N",0,"UNIDAD",112,null,"UNIDAD",0,null,"291000100055",null,"291000100055","TEMPERA CON APLICADOR X 250 mL COLOR AZUL","UNIDAD",4.4000000000000004]
["0025","PLASTILINA DELGADA JUEGO X 10",112,"A","31","75","0004","A",112,2016,1004,"B",7.2,112,"18/06/2015 10:00:33.72","A","04744514","A_SIGA","2","18/06/2015 10:00:33.72","04744514",null,"0",0,0,0,0,"N",0,"UNIDAD",112,null,"UNIDAD",0,null,"317500040025",null,"317500040025","PLASTILINA DELGADA JUEGO X 10","UNIDAD",7.2]
["0009","GLOBOS TAMAÑO MEDIANO DE VARIOS COLORES",112,"A","31","75","0010","A",112,2016,1004,"B",0.2,112,"23/06/2015 10:34:13.983","A","04744514","A_SIGA","2","23/06/2015 10:34:13.983","04744514",null,"0",0,0,0,0,"N",0,"UNIDAD",112,null,"UNIDAD",0,null,"317500100009",null,"317500100009","GLOBOS TAMAÑO MEDIANO DE VARIOS COLORES","UNIDAD",0.2]
["0508","LAMINA EN MICROPOROSO COLORES VARIADOS",112,"A","31","75","0010","A",112,2016,1004,"B",11.1746,112,"18/06/2015 10:00:33.72","A","04744514","A_SIGA","2","18/06/2015 10:00:33.72","04744514",null,"0",0,0,0,0,"N",0,"UNIDAD",112,null,"UNIDAD",0,null,"317500100508",null,"317500100508","LAMINA EN MICROPOROSO COLORES VARIADOS","UNIDAD",11.1746]
[]
["0075","PERFORADOR MANUAL PARA METAL",112,"A","41","10","0009","A",112,2016,1004,"B",12.88,112,"03/06/2015 15:28:35.876","A","01980772","ESCAL1","2","08/06/2015 14:53:26.64","01980772",null,"0",0,0,0,0,"N",0,"UNIDAD",112,null,"UNIDAD",0,null,{"$f":"CONCATENATE(E81,F81,G81,A81)","v":"411000090075"},null,"411000090075","PERFORADOR MANUAL PARA METAL","UNIDAD",12.88]
["0134","CUCHILLA CORTA PAPEL TAMAÑO MEDIANO",112,"A","41","10","0009","A",112,2016,1004,"B",0.1003,112,"03/06/2015 10:58:38.11","A","04744514","A_SIGA","2","08/06/2015 14:53:26.64","01980772",null,"0",0,0,0,0,"N",0,"UNIDAD",112,null,"UNIDAD",0,null,{"$f":"CONCATENATE(E82,F82,G82,A82)","v":"411000090134"},null,"411000090134","CUCHILLA CORTA PAPEL TAMAÑO MEDIANO","UNIDAD",0.1003]
[]
["0040","MICA PARA ANILLAR TAMAÑO A4",112,"A","44","36","0012","A",112,2016,1004,"B",23,112,"03/06/2015 15:28:35.876","A","01980772","ESCAL1","2","08/06/2015 14:53:26.64","01980772",null,"0",0,0,0,0,"N",0,"UNIDAD",112,null,"UNIDAD",0,null,{"$f":"CONCATENATE(E84,F84,G84,A84)","v":"443600120040"},null,"443600120040","MICA PARA ANILLAR TAMAÑO A4","UNIDAD",23]
["0040","ESPIRAL DE PLASTICO 14 mm",112,"A","44","36","0013","A",112,2016,1004,"B",0.15,112,"03/06/2015 10:58:38.11","A","04744514","A_SIGA","2","08/06/2015 14:53:26.64","01980772",null,"0",0,0,0,0,"N",0,"UNIDAD",112,null,"UNIDAD",0,null,"443600130040",null,"443600130040","ESPIRAL DE PLASTICO 14 mm","UNIDAD",0.15]
["0078","ESPIRAL DE PLASTICO 12 mm",112,"A","44","36","0013","A",112,2016,1004,"B",0.11,112,"03/06/2015 10:58:38.11","A","04744514","A_SIGA","2","08/06/2015 14:53:26.64","01980772",null,"0",0,0,0,0,"N",0,"UNIDAD",112,null,"UNIDAD",0,null,"443600130078",null,"443600130078","ESPIRAL DE PLASTICO 12 mm","UNIDAD",0.11]
["0084","ESPIRAL DE PLASTICO 7 mm",112,"A","44","36","0013","A",112,2016,1004,"B",0.5,112,"03/06/2015 10:58:38.11","A","04744514","A_SIGA","2","08/06/2015 14:53:26.64","01980772",null,"0",0,0,0,0,"N",0,"UNIDAD",112,null,"UNIDAD",0,null,"443600130084",null,"443600130084","ESPIRAL DE PLASTICO 7 mm","UNIDAD",0.5]
["0012","TAPA PLASTIFICADA PARA ANILLADO TAMAÑO A4",112,"A","44","36","0023","A",112,2016,1004,"B",0.22,112,"04/06/2015 15:07:32.983","A","01980772","ESCAL1","2","08/06/2015 14:53:26.64","01980772",null,"0",0,0,0,0,"N",0,"UNIDAD",112,null,"UNIDAD",0,null,"443600230012",null,"443600230012","TAPA PLASTIFICADA PARA ANILLADO TAMAÑO A4","UNIDAD",0.22]
["0001","STENCIL SIMPLE",112,"A","44","51","0020","A",112,2016,1004,"B",33.51,112,"08/06/2015 09:09:46.343","A","01980772","ESCAL1","2","08/06/2015 14:53:26.64","01980772",null,"0",0,0,0,0,"N",0,"UNIDAD",112,null,"UNIDAD",null,null,"445100200001",null,"445100200001","STENCIL SIMPLE","UNIDAD",33.51]
["0005","TINTA PARA MIMEOGRAFO X 217 mL",112,"A","44","51","0025","A",112,2016,1004,"B",15,112,"04/06/2015 15:07:32.983","A","01980772","ESCAL1","2","08/06/2015 14:53:26.64","01980772",null,"0",0,0,0,0,"N",0,"UNIDAD",112,null,"UNIDAD",0,null,"445100250005",null,"445100250005","TINTA PARA MIMEOGRAFO X 217 mL","UNIDAD",15]
[]
["1123","JUEGO DE LAMINAS, FICHAS, RECETARIOS Y FOLLETO DE ANIMACION A LA LECTURA EN ESTUCHE",112,"A","47","03","0014","A",112,2016,1004,"B",118.59460300000001,112,"23/06/2015 10:34:13.983","A","04744514","A_SIGA","2","23/06/2015 10:34:13.983","04744514",null,"0",0,0,0,0,"N",0,"UNIDAD",112,null,"UNIDAD",0,null,{"$f":"CONCATENATE(E92,F92,G92,A92)","v":"470300141123"},null,"470300141123","JUEGO DE LAMINAS, FICHAS, RECETARIOS Y FOLLETO DE ANIMACION A LA LECTURA EN ESTUCHE","UNIDAD",118.59460300000001]
["0531","GUIA DOCENTE PARA EL USO DEL CUADERNO DE TRABAJO APRENDEMOS JUGANDO PARA NIÑOS Y NIÑAS DE 4 AÑOS",112,"A","47","40","0006","A",112,2016,1505,"B",4.8099999999999996,112,"17/06/2015 20:52:28.193","A","02050907","A_SIGA","2","18/06/2015 20:51:35.89","02050907",null,"0",0,0,0,0,"N",0,"UNIDAD",112,null,"UNIDAD",0,null,{"$f":"CONCATENATE(E93,F93,G93,A93)","v":"474000060531"},null,"474000060531","GUIA DOCENTE PARA EL USO DEL CUADERNO DE TRABAJO APRENDEMOS JUGANDO PARA NIÑOS Y NIÑAS DE 4 AÑOS","UNIDAD",4.8099999999999996]
[]
["7086","LIBRO LEY DE PROCEDIMIENTO ADMINISTRATIVO GENERAL - LEY 27444",112,"A","54","11","0001","A",112,2016,1004,"B",210,112,"23/06/2015 10:34:13.983","A","04744514","A_SIGA","2","23/06/2015 10:34:13.983","04744514",null,"0",0,0,0,0,"N",0,"UNIDAD",112,null,"UNIDAD",0,null,{"$f":"CONCATENATE(E95,F95,G95,A95)","v":"541100017086"},null,"541100017086","LIBRO LEY DE PROCEDIMIENTO ADMINISTRATIVO GENERAL - LEY 27444","UNIDAD",210]
["0398","MANUAL DE COMPRENSION DE LECTURA PARA DOCENTES DE EDUCACION SECUNDARIA - MCL 2",112,"A","54","11","0003","A",112,2016,1505,"B",3.22,112,"17/06/2015 20:52:28.193","A","02050907","A_SIGA","2","18/06/2015 20:51:35.89","02050907",null,"0",0,0,0,0,"N",0,"UNIDAD",112,null,"UNIDAD",0,null,"541100030398",null,"541100030398","MANUAL DE COMPRENSION DE LECTURA PARA DOCENTES DE EDUCACION SECUNDARIA - MCL 2","UNIDAD",3.22]
["0399","MANUAL DE COMPRENSION DE LECTURA PARA DOCENTES DE EDUCACION SECUNDARIA - MCL 3",112,"A","54","11","0003","A",112,2016,1505,"B",4.63,112,"17/06/2015 20:52:28.193","A","02050907","A_SIGA","2","18/06/2015 20:51:35.89","02050907",null,"0",0,0,0,0,"N",0,"UNIDAD",112,null,"UNIDAD",0,null,"541100030399",null,"541100030399","MANUAL DE COMPRENSION DE LECTURA PARA DOCENTES DE EDUCACION SECUNDARIA - MCL 3","UNIDAD",4.63]
["0400","MANUAL DE COMPRENSION DE LECTURA PARA DOCENTES DE EDUCACION SECUNDARIA - MCL 4",112,"A","54","11","0003","A",112,2016,1505,"B",4.6399999999999997,112,"17/06/2015 20:52:28.193","A","02050907","A_SIGA","2","18/06/2015 20:51:35.89","02050907",null,"0",0,0,0,0,"N",0,"UNIDAD",112,null,"UNIDAD",0,null,"541100030400",null,"541100030400","MANUAL DE COMPRENSION DE LECTURA PARA DOCENTES DE EDUCACION SECUNDARIA - MCL 4","UNIDAD",4.6399999999999997]
["0401","MANUAL DE COMPRENSION DE LECTURA PARA DOCENTES DE EDUCACION SECUNDARIA - MCL 5",112,"A","54","11","0003","A",112,2016,1505,"B",3.11,112,"17/06/2015 20:52:28.193","A","02050907","A_SIGA","2","18/06/2015 20:51:35.89","02050907",null,"0",0,0,0,0,"N",0,"UNIDAD",112,null,"UNIDAD",0,null,"541100030401",null,"541100030401","MANUAL DE COMPRENSION DE LECTURA PARA DOCENTES DE EDUCACION SECUNDARIA - MCL 5","UNIDAD",3.11]
["0402","MANUAL DE COMPRENSION DE LECTURA PARA DOCENTES DE EDUCACION SECUNDARIA - MCL 6",112,"A","54","11","0003","A",112,2016,1505,"B",3.24,112,"17/06/2015 20:52:28.193","A","02050907","A_SIGA","2","18/06/2015 20:51:35.89","02050907",null,"0",0,0,0,0,"N",0,"UNIDAD",112,null,"UNIDAD",0,null,"541100030402",null,"541100030402","MANUAL DE COMPRENSION DE LECTURA PARA DOCENTES DE EDUCACION SECUNDARIA - MCL 6","UNIDAD",3.24]
["0253","CUADERNO PARA EL ESTUDIANTE COMPRENSION LECTORA 4",112,"A","54","11","0005","A",112,2016,1505,"B",3.11,112,"17/06/2015 20:52:28.193","A","02050907","A_SIGA","2","18/06/2015 20:51:35.89","02050907",null,"0",0,0,0,0,"N",0,"UNIDAD",112,null,"UNIDAD",0,null,"541100050253",null,"541100050253","CUADERNO PARA EL ESTUDIANTE COMPRENSION LECTORA 4","UNIDAD",3.11]
["0254","CUADERNO PARA EL ESTUDIANTE COMPRENSION LECTORA 5",112,"A","54","11","0005","A",112,2016,1505,"B",3.24,112,"17/06/2015 20:52:28.193","A","02050907","A_SIGA","2","18/06/2015 20:51:35.89","02050907",null,"0",0,0,0,0,"N",0,"UNIDAD",112,null,"UNIDAD",0,null,"541100050254",null,"541100050254","CUADERNO PARA EL ESTUDIANTE COMPRENSION LECTORA 5","UNIDAD",3.24]
["3121","CUADERNO PARA EL ESTUDIANTE COMPRENSION LECTORA 1",112,"A","54","11","0005","A",112,2016,1505,"B",3.22,112,"17/06/2015 20:52:28.193","A","02050907","A_SIGA","2","18/06/2015 20:51:35.89","02050907",null,"0",0,0,0,0,"N",0,"UNIDAD",112,null,"UNIDAD",0,null,"541100053121",null,"541100053121","CUADERNO PARA EL ESTUDIANTE COMPRENSION LECTORA 1","UNIDAD",3.22]
["3122","CUADERNO PARA EL ESTUDIANTE COMPRENSION LECTORA 2",112,"A","54","11","0005","A",112,2016,1505,"B",4.63,112,"17/06/2015 20:52:28.193","A","02050907","A_SIGA","2","18/06/2015 20:51:35.89","02050907",null,"0",0,0,0,0,"N",0,"UNIDAD",112,null,"UNIDAD",0,null,"541100053122",null,"541100053122","CUADERNO PARA EL ESTUDIANTE COMPRENSION LECTORA 2","UNIDAD",4.63]
["3123","CUADERNO PARA EL ESTUDIANTE COMPRENSION LECTORA 3",112,"A","54","11","0005","A",112,2016,1505,"B",4.6399999999999997,112,"17/06/2015 20:52:28.193","A","02050907","A_SIGA","2","18/06/2015 20:51:35.89","02050907",null,"0",0,0,0,0,"N",0,"UNIDAD",112,null,"UNIDAD",0,null,"541100053123",null,"541100053123","CUADERNO PARA EL ESTUDIANTE COMPRENSION LECTORA 3","UNIDAD",4.6399999999999997]
["3338","LIBRO COSTEO DE PROCEDIMIENTO Y SERVICIOS ADMINISTRATIVOS EN EL MARCO DEL SISTEMA CBA",112,"A","54","11","0005","A",112,2016,1004,"B",100,112,"03/06/2015 15:28:35.876","A","01980772","ESCAL1","2","08/06/2015 14:53:26.64","01980772",null,"0",0,0,0,0,"N",0,"UNIDAD",112,null,"UNIDAD",0,null,"541100053338",null,"541100053338","LIBRO COSTEO DE PROCEDIMIENTO Y SERVICIOS ADMINISTRATIVOS EN EL MARCO DEL SISTEMA CBA","UNIDAD",100]
["3555","CUADERNO DE AUTOAPRENDIZAJE DE MATEMATICA 3° GRADO DE PRIMARIA",112,"A","54","11","0005","A",112,2016,1004,"B",3.2463320000000002,112,"23/06/2015 10:34:13.983","A","04744514","A_SIGA","2","23/06/2015 10:34:13.983","04744514",null,"0",0,0,0,0,"N",0,"UNIDAD",112,null,"UNIDAD",0,null,"541100053555",null,"541100053555","CUADERNO DE AUTOAPRENDIZAJE DE MATEMATICA 3° GRADO DE PRIMARIA","UNIDAD",3.2463320000000002]
["3556","CUADERNO DE AUTOAPRENDIZAJE DE MATEMATICA 4° GRADO DE PRIMARIA",112,"A","54","11","0005","A",112,2016,1004,"B",3.2463320000000002,112,"23/06/2015 10:34:13.983","A","04744514","A_SIGA","2","23/06/2015 10:34:13.983","04744514",null,"0",0,0,0,0,"N",0,"UNIDAD",112,null,"UNIDAD",0,null,"541100053556",null,"541100053556","CUADERNO DE AUTOAPRENDIZAJE DE MATEMATICA 4° GRADO DE PRIMARIA","UNIDAD",3.2463320000000002]
["3557","CUADERNO DE AUTOAPRENDIZAJE DE MATEMATICA 5° GRADO DE PRIMARIA",112,"A","54","11","0005","A",112,2016,1004,"B",3.1557300000000001,112,"23/06/2015 10:34:13.983","A","04744514","A_SIGA","2","23/06/2015 10:34:13.983","04744514",null,"0",0,0,0,0,"N",0,"UNIDAD",112,null,"UNIDAD",0,null,"541100053557",null,"541100053557","CUADERNO DE AUTOAPRENDIZAJE DE MATEMATICA 5° GRADO DE PRIMARIA","UNIDAD",3.1557300000000001]
["3558","CUADERNO DE AUTOAPRENDIZAJE DE MATEMATICA 6° GRADO DE PRIMARIA",112,"A","54","11","0005","A",112,2016,1004,"B",3.310746,112,"23/06/2015 10:34:13.983","A","04744514","A_SIGA","2","23/06/2015 10:34:13.983","04744514",null,"0",0,0,0,0,"N",0,"UNIDAD",112,null,"UNIDAD",0,null,"541100053558",null,"541100053558","CUADERNO DE AUTOAPRENDIZAJE DE MATEMATICA 6° GRADO DE PRIMARIA","UNIDAD",3.310746]
["3564","CUADERNO DE AUTOAPRENDIZAJE DE COMUNICACION 3° GRADO DE PRIMARIA",112,"A","54","11","0005","A",112,2016,1004,"B",2.8816739999999998,112,"23/06/2015 10:34:13.983","A","04744514","A_SIGA","2","23/06/2015 10:34:13.983","04744514",null,"0",0,0,0,0,"N",0,"UNIDAD",112,null,"UNIDAD",0,null,"541100053564",null,"541100053564","CUADERNO DE AUTOAPRENDIZAJE DE COMUNICACION 3° GRADO DE PRIMARIA","UNIDAD",2.8816739999999998]
["3565","CUADERNO DE AUTOAPRENDIZAJE DE COMUNICACION 4° GRADO DE PRIMARIA",112,"A","54","11","0005","A",112,2016,1004,"B",3.1368269999999998,112,"23/06/2015 10:34:13.983","A","04744514","A_SIGA","2","23/06/2015 10:34:13.983","04744514",null,"0",0,0,0,0,"N",0,"UNIDAD",112,null,"UNIDAD",0,null,"541100053565",null,"541100053565","CUADERNO DE AUTOAPRENDIZAJE DE COMUNICACION 4° GRADO DE PRIMARIA","UNIDAD",3.1368269999999998]
["3566","CUADERNO DE AUTOAPRENDIZAJE DE COMUNICACION 5° GRADO DE PRIMARIA",112,"A","54","11","0005","A",112,2016,1004,"B",2.781533,112,"23/06/2015 10:34:13.983","A","04744514","A_SIGA","2","23/06/2015 10:34:13.983","04744514",null,"0",0,0,0,0,"N",0,"UNIDAD",112,null,"UNIDAD",0,null,"541100053566",null,"541100053566","CUADERNO DE AUTOAPRENDIZAJE DE COMUNICACION 5° GRADO DE PRIMARIA","UNIDAD",2.781533]
["3567","CUADERNO DE AUTOAPRENDIZAJE DE COMUNICACION 6° GRADO DE PRIMARIA",112,"A","54","11","0005","A",112,2016,1004,"B",2.7813789999999998,112,"23/06/2015 10:34:13.983","A","04744514","A_SIGA","2","23/06/2015 10:34:13.983","04744514",null,"0",0,0,0,0,"N",0,"UNIDAD",112,null,"UNIDAD",0,null,"541100053567",null,"541100053567","CUADERNO DE AUTOAPRENDIZAJE DE COMUNICACION 6° GRADO DE PRIMARIA","UNIDAD",2.7813789999999998]
["4076","LIBRO PROCEDIMIENTOS ADMINISTRATIVO DISCIPLINARIO",112,"A","54","11","0005","A",112,2016,1004,"B",210,112,"03/06/2015 15:28:35.876","A","01980772","ESCAL1","2","08/06/2015 14:53:26.64","01980772",null,"0",0,0,0,0,"N",0,"UNIDAD",112,null,"UNIDAD",0,null,"541100054076",null,"541100054076","LIBRO PROCEDIMIENTOS ADMINISTRATIVO DISCIPLINARIO","UNIDAD",210]
["4944","CUADERNO DE TRABAJO COMUNICACIÓN AIMARA 1º PRIMARIA",112,"A","54","11","0005","A",112,2016,1505,"B",4.0999999999999996,112,"17/06/2015 20:52:28.193","A","02050907","A_SIGA","2","18/06/2015 20:51:35.89","02050907",null,"0",0,0,0,0,"N",0,"UNIDAD",112,null,"UNIDAD",0,null,"541100054944",null,"541100054944","CUADERNO DE TRABAJO COMUNICACIÓN AIMARA 1º PRIMARIA","UNIDAD",4.0999999999999996]
["4951","CUADERNO DE TRABAJO MATEMÁTICA AIMARA 1º PRIMARIA",112,"A","54","11","0005","A",112,2016,1505,"B",4.0999999999999996,112,"16/06/2015 22:47:17.406","A","04744514","A_SIGA","2","18/06/2015 20:51:35.89","02050907",null,"0",0,0,0,0,"N",0,"UNIDAD",112,null,"UNIDAD",0,null,"541100054951",null,"541100054951","CUADERNO DE TRABAJO MATEMÁTICA AIMARA 1º PRIMARIA","UNIDAD",4.0999999999999996]
["4965","CUADERNO DE TRABAJO COMUNICACIÓN AIMARA 2º PRIMARIA",112,"A","54","11","0005","A",112,2016,1505,"B",4.0999999999999996,112,"17/06/2015 20:52:28.193","A","02050907","A_SIGA","2","18/06/2015 20:51:35.89","02050907",null,"0",0,0,0,0,"N",0,"UNIDAD",112,null,"UNIDAD",0,null,"541100054965",null,"541100054965","CUADERNO DE TRABAJO COMUNICACIÓN AIMARA 2º PRIMARIA","UNIDAD",4.0999999999999996]
["4972","CUADERNO DE TRABAJO MATEMÁTICA AIMARA 2º PRIMARIA",112,"A","54","11","0005","A",112,2016,1505,"B",4.0999999999999996,112,"16/06/2015 22:47:17.406","A","04744514","A_SIGA","2","18/06/2015 20:51:35.89","02050907",null,"0",0,0,0,0,"N",0,"UNIDAD",112,null,"UNIDAD",0,null,"541100054972",null,"541100054972","CUADERNO DE TRABAJO MATEMÁTICA AIMARA 2º PRIMARIA","UNIDAD",4.0999999999999996]
["4986","CUADERNO DE TRABAJO COMUNICACIÓN AIMARA 3º PRIMARIA",112,"A","54","11","0005","A",112,2016,1505,"B",4,112,"17/06/2015 20:52:28.193","A","02050907","A_SIGA","2","18/06/2015 20:51:35.89","02050907",null,"0",0,0,0,0,"N",0,"UNIDAD",112,null,"UNIDAD",0,null,"541100054986",null,"541100054986","CUADERNO DE TRABAJO COMUNICACIÓN AIMARA 3º PRIMARIA","UNIDAD",4]
["4993","CUADERNO DE TRABAJO MATEMÁTICA AIMARA 3º PRIMARIA",112,"A","54","11","0005","A",112,2016,1505,"B",4,112,"16/06/2015 22:47:17.406","A","04744514","A_SIGA","2","18/06/2015 20:51:35.89","02050907",null,"0",0,0,0,0,"N",0,"UNIDAD",112,null,"UNIDAD",0,null,"541100054993",null,"541100054993","CUADERNO DE TRABAJO MATEMÁTICA AIMARA 3º PRIMARIA","UNIDAD",4]
["5007","CUADERNO DE TRABAJO COMUNICACIÓN AIMARA 4º PRIMARIA",112,"A","54","11","0005","A",112,2016,1505,"B",4,112,"17/06/2015 20:52:28.193","A","02050907","A_SIGA","2","18/06/2015 20:51:35.89","02050907",null,"0",0,0,0,0,"N",0,"UNIDAD",112,null,"UNIDAD",0,null,"541100055007",null,"541100055007","CUADERNO DE TRABAJO COMUNICACIÓN AIMARA 4º PRIMARIA","UNIDAD",4]
["5014","CUADERNO DE TRABAJO MATEMÁTICA AIMARA 4º PRIMARIA",112,"A","54","11","0005","A",112,2016,1505,"B",4,112,"16/06/2015 22:47:17.406","A","04744514","A_SIGA","2","18/06/2015 20:51:35.89","02050907",null,"0",0,0,0,0,"N",0,"UNIDAD",112,null,"UNIDAD",0,null,"541100055014",null,"541100055014","CUADERNO DE TRABAJO MATEMÁTICA AIMARA 4º PRIMARIA","UNIDAD",4]
["5028","CUADERNO DE TRABAJO COMUNICACIÓN AIMARA 5º PRIMARIA",112,"A","54","11","0005","A",112,2016,1505,"B",4,112,"17/06/2015 20:52:28.193","A","02050907","A_SIGA","2","18/06/2015 20:51:35.89","02050907",null,"0",0,0,0,0,"N",0,"UNIDAD",112,null,"UNIDAD",0,null,"541100055028",null,"541100055028","CUADERNO DE TRABAJO COMUNICACIÓN AIMARA 5º PRIMARIA","UNIDAD",4]
["5118","CUADERNO DE TRABAJO INTEGRADO AIMARA II (4 AÑOS)",112,"A","54","11","0005","A",112,2016,1505,"B",15.23,112,"17/06/2015 20:52:28.193","A","02050907","A_SIGA","2","18/06/2015 20:51:35.89","02050907",null,"0",0,0,0,0,"N",0,"UNIDAD",112,null,"UNIDAD",0,null,"541100055118",null,"541100055118","CUADERNO DE TRABAJO INTEGRADO AIMARA II (4 AÑOS)","UNIDAD",15.23]
["5125","CUADERNO DE TRABAJO INTEGRADO AIMARA II (5 AÑOS)",112,"A","54","11","0005","A",112,2016,1505,"B",15.23,112,"17/06/2015 20:52:28.193","A","02050907","A_SIGA","2","18/06/2015 20:51:35.89","02050907",null,"0",0,0,0,0,"N",0,"UNIDAD",112,null,"UNIDAD",0,null,"541100055125",null,"541100055125","CUADERNO DE TRABAJO INTEGRADO AIMARA II (5 AÑOS)","UNIDAD",15.23]
["7229","CUADERNO DE TRABAJO APRENDE CONMIGO COMUNICACIÓN CASTELLANO 1º PRIMARIA",112,"A","54","11","0005","A",112,2016,1505,"B",2.2000000000000002,112,"17/06/2015 20:52:28.193","A","02050907","A_SIGA","2","18/06/2015 20:51:35.89","02050907",null,"0",0,0,0,0,"N",0,"UNIDAD",112,null,"UNIDAD",0,null,"541100057229",null,"541100057229","CUADERNO DE TRABAJO APRENDE CONMIGO COMUNICACIÓN CASTELLANO 1º PRIMARIA","UNIDAD",2.2000000000000002]
["7230","CUADERNO DE TRABAJO APRENDE CONMIGO COMUNICACIÓN CASTELLANO 2º PRIMARIA",112,"A","54","11","0005","A",112,2016,1505,"B",2.62,112,"17/06/2015 20:52:28.193","A","02050907","A_SIGA","2","18/06/2015 20:51:35.89","02050907",null,"0",0,0,0,0,"N",0,"UNIDAD",112,null,"UNIDAD",0,null,"541100057230",null,"541100057230","CUADERNO DE TRABAJO APRENDE CONMIGO COMUNICACIÓN CASTELLANO 2º PRIMARIA","UNIDAD",2.62]
["7231","CUADERNO DE TRABAJO APRENDE CONMIGO COMUNICACIÓN CASTELLANO 3º PRIMARIA",112,"A","54","11","0005","A",112,2016,1505,"B",2.62,112,"17/06/2015 20:52:28.193","A","02050907","A_SIGA","2","18/06/2015 20:51:35.89","02050907",null,"0",0,0,0,0,"N",0,"UNIDAD",112,null,"UNIDAD",0,null,"541100057231",null,"541100057231","CUADERNO DE TRABAJO APRENDE CONMIGO COMUNICACIÓN CASTELLANO 3º PRIMARIA","UNIDAD",2.62]
["7232","CUADERNO DE TRABAJO APRENDE CONMIGO COMUNICACIÓN CASTELLANO 4º PRIMARIA",112,"A","54","11","0005","A",112,2016,1505,"B",2.62,112,"17/06/2015 20:52:28.193","A","02050907","A_SIGA","2","18/06/2015 20:51:35.89","02050907",null,"0",0,0,0,0,"N",0,"UNIDAD",112,null,"UNIDAD",0,null,"541100057232",null,"541100057232","CUADERNO DE TRABAJO APRENDE CONMIGO COMUNICACIÓN CASTELLANO 4º PRIMARIA","UNIDAD",2.62]
["7233","CUADERNO DE TRABAJO APRENDE CONMIGO COMUNICACIÓN CASTELLANO 5º PRIMARIA",112,"A","54","11","0005","A",112,2016,1505,"B",2.5499999999999998,112,"17/06/2015 20:52:28.193","A","02050907","A_SIGA","2","18/06/2015 20:51:35.89","02050907",null,"0",0,0,0,0,"N",0,"UNIDAD",112,null,"UNIDAD",0,null,"541100057233",null,{"$f":"+AJ131","v":"541100057233"},{"$f":"+B131","v":"CUADERNO DE TRABAJO APRENDE CONMIGO COMUNICACIÓN CASTELLANO 5º PRIMARIA"},{"$f":"+AG131","v":"UNIDAD"},{"$f":"+M131","v":2.5499999999999998}]
["7234","CUADERNO DE TRABAJO INTEGRADO CIENCIA Y CIUDADANÍA AIMARA 1º PRIMARIA",112,"A","54","11","0005","A",112,2016,1505,"B",4.0999999999999996,112,"17/06/2015 20:52:28.193","A","02050907","A_SIGA","2","18/06/2015 20:51:35.89","02050907",null,"0",0,0,0,0,"N",0,"UNIDAD",112,null,"UNIDAD",0,null,"541100057234",null,"541100057234","CUADERNO DE TRABAJO INTEGRADO CIENCIA Y CIUDADANÍA AIMARA 1º PRIMARIA","UNIDAD",4.0999999999999996]
["7235","CUADERNO DE TRABAJO INTEGRADO CIENCIA Y CIUDADANÍA AIMARA 2º PRIMARIA",112,"A","54","11","0005","A",112,2016,1505,"B",4.0999999999999996,112,"17/06/2015 20:52:28.193","A","02050907","A_SIGA","2","18/06/2015 20:51:35.89","02050907",null,"0",0,0,0,0,"N",0,"UNIDAD",112,null,"UNIDAD",0,null,"541100057235",null,"541100057235","CUADERNO DE TRABAJO INTEGRADO CIENCIA Y CIUDADANÍA AIMARA 2º PRIMARIA","UNIDAD",4.0999999999999996]
["7236","CUADERNO DE TRABAJO INTEGRADO CIENCIA Y CIUDADANÍA AIMARA 3º PRIMARIA",112,"A","54","11","0005","A",112,2016,1505,"B",4,112,"17/06/2015 20:52:28.193","A","02050907","A_SIGA","2","18/06/2015 20:51:35.89","02050907",null,"0",0,0,0,0,"N",0,"UNIDAD",112,null,"UNIDAD",0,null,"541100057236",null,"541100057236","CUADERNO DE TRABAJO INTEGRADO CIENCIA Y CIUDADANÍA AIMARA 3º PRIMARIA","UNIDAD",4]
["7237","CUADERNO DE TRABAJO INTEGRADO CIENCIA Y CIUDADANÍA AIMARA 4º PRIMARIA",112,"A","54","11","0005","A",112,2016,1505,"B",4,112,"17/06/2015 20:52:28.193","A","02050907","A_SIGA","2","18/06/2015 20:51:35.89","02050907",null,"0",0,0,0,0,"N",0,"UNIDAD",112,null,"UNIDAD",0,null,"541100057237",null,"541100057237","CUADERNO DE TRABAJO INTEGRADO CIENCIA Y CIUDADANÍA AIMARA 4º PRIMARIA","UNIDAD",4]
["7238","CUADERNO DE TRABAJO INTEGRADO CIENCIA Y CIUDADANÍA AIMARA 5º PRIMARIA",112,"A","54","11","0005","A",112,2016,1505,"B",4,112,"17/06/2015 20:52:28.193","A","02050907","A_SIGA","2","18/06/2015 20:51:35.89","02050907",null,"0",0,0,0,0,"N",0,"UNIDAD",112,null,"UNIDAD",0,null,"541100057238",null,"541100057238","CUADERNO DE TRABAJO INTEGRADO CIENCIA Y CIUDADANÍA AIMARA 5º PRIMARIA","UNIDAD",4]
["7303","LIBRO PROCEDIMIENTO ADMINISTRATIVO",112,"A","54","11","0005","A",112,2016,1004,"B",180,112,"03/06/2015 15:28:35.876","A","01980772","ESCAL1","2","08/06/2015 14:53:26.64","01980772",null,"0",0,0,0,0,"N",0,"UNIDAD",112,null,"UNIDAD",0,null,"541100057303",null,"541100057303","LIBRO PROCEDIMIENTO ADMINISTRATIVO","UNIDAD",180]
[]
["0010","TACHO DE PLÁSTICO TIPO SANSON 50 L APROX.",112,"A","64","61","0003","A",112,2016,1004,"B",31.5,112,"04/06/2015 15:07:32.983","A","01980772","ESCAL1","2","08/06/2015 14:53:26.64","01980772",null,"0",0,0,0,0,"N",0,"UNIDAD",112,null,"UNIDAD",0,null,{"$f":"CONCATENATE(E139,F139,G139,A139)","v":"646100030010"},null,"646100030010","TACHO DE PLÁSTICO TIPO SANSON 50 L APROX.","UNIDAD",31.5]
["0011","TACHO DE PLÁSTICO TIPO SANSON 75 L APROX.",112,"A","64","61","0003","A",112,2016,1004,"B",28,112,"04/06/2015 15:07:32.983","A","01980772","ESCAL1","2","08/06/2015 14:53:26.64","01980772",null,"0",0,0,0,0,"N",0,"UNIDAD",112,null,"UNIDAD",0,null,"646100030011",null,"646100030011","TACHO DE PLÁSTICO TIPO SANSON 75 L APROX.","UNIDAD",28]
["0027","TACHO DE PLÁSTICO TIPO SANSON 100 L APROX.",112,"A","64","61","0003","A",112,2016,1004,"B",59.98,112,"23/06/2015 10:34:13.983","A","04744514","A_SIGA","2","23/06/2015 10:34:13.983","04744514",null,"0",0,0,0,0,"N",0,"UNIDAD",112,null,"UNIDAD",0,null,"646100030027",null,"646100030027","TACHO DE PLÁSTICO TIPO SANSON 100 L APROX.","UNIDAD",59.98]
["0124","TACHO DE PLÁSTICO CON TAPA VAIVÉN 20 L APROX.",112,"A","64","61","0003","A",112,2016,1505,"B",9,112,"04/06/2015 21:59:24.516","A","02050907","A_SIGA","2","08/06/2015 02:32:33.403","02050907",null,"0",0,0,0,0,"N",0,"UNIDAD",112,null,"UNIDAD",0,null,"646100030124",null,"646100030124","TACHO DE PLÁSTICO CON TAPA VAIVÉN 20 L APROX.","UNIDAD",9]
["0240","TACHO DE POLIETILENO PARA RECICLAJE DE BASURA 16 L APROX.",112,"A","64","61","0003","A",112,2016,1004,"B",18.5,112,"23/06/2015 10:34:13.983","A","04744514","A_SIGA","2","23/06/2015 10:34:13.983","04744514",null,"0",0,0,0,0,"N",0,"UNIDAD",112,null,"UNIDAD",0,null,"646100030240",null,"646100030240","TACHO DE POLIETILENO PARA RECICLAJE DE BASURA 16 L APROX.","UNIDAD",18.5]
["0003","BALDE DE PLASTICO X 20 L",112,"A","64","61","0006","A",112,2016,1004,"B",22.5,112,"03/06/2015 10:58:38.11","A","04744514","A_SIGA","2","08/06/2015 14:53:26.64","01980772",null,"0",0,0,0,0,"N",0,"UNIDAD",112,null,"UNIDAD",0,null,"646100060003",null,"646100060003","BALDE DE PLASTICO X 20 L","UNIDAD",22.5]
["0005","LAVATORIO DE PLASTICO X 10 L",112,"A","64","61","0008","A",112,2016,1505,"B",8.5,112,"17/06/2015 20:52:28.193","A","02050907","A_SIGA","2","18/06/2015 20:51:35.89","02050907",null,"0",0,0,0,0,"N",0,"UNIDAD",112,null,"UNIDAD",0,null,"646100080005",null,"646100080005","LAVATORIO DE PLASTICO X 10 L","UNIDAD",8.5]
["0047","LAVATORIO DE PLASTICO X 23 L",112,"A","64","61","0008","A",112,2016,1004,"B",6.5,112,"23/06/2015 10:34:13.983","A","04744514","A_SIGA","2","23/06/2015 10:34:13.983","04744514",null,"0",0,0,0,0,"N",0,"UNIDAD",112,null,"UNIDAD",0,null,"646100080047",null,"646100080047","LAVATORIO DE PLASTICO X 23 L","UNIDAD",6.5]
[]
["0004","CINTA ADHESIVA TRANSPARENTE 1 in X 72 yd",112,"A","71","03","0001","A",112,2016,1004,"B",3.58,112,"03/06/2015 10:58:38.11","A","04744514","A_SIGA","2","08/06/2015 14:53:26.64","01980772",null,"0",0,0,0,0,"N",0,"UNIDAD",112,null,"UNIDAD",null,null,{"$f":"CONCATENATE(E148,F148,G148,A148)","v":"710300010004"},null,"710300010004","CINTA ADHESIVA TRANSPARENTE 1 in X 72 yd","UNIDAD",3.58]
["0010","CINTA ADHESIVA TRANSPARENTE 2 in X 72 yd",112,"A","71","03","0001","A",112,2016,1004,"B",0.97,112,"03/06/2015 10:58:38.11","A","04744514","A_SIGA","2","08/06/2015 14:53:26.64","01980772",null,"0",0,0,0,0,"N",0,"UNIDAD",112,null,"UNIDAD",null,null,"710300010010",null,"710300010010","CINTA ADHESIVA TRANSPARENTE 2 in X 72 yd","UNIDAD",0.97]
["0022","CINTA ADHESIVA TRANSPARENTE 2 in X 55 yd",112,"A","71","03","0001","A",112,2016,1505,"B",2.9,112,"04/06/2015 21:59:24.516","A","02050907","A_SIGA","2","08/06/2015 02:32:33.403","02050907",null,"0",0,0,0,0,"N",0,"UNIDAD",112,null,"UNIDAD",null,null,"710300010022",null,"710300010022","CINTA ADHESIVA TRANSPARENTE 2 in X 55 yd","UNIDAD",2.9]
["0045","CINTA ADHESIVA TRANSPARENTE 2 in X 40 yd",112,"A","71","03","0001","A",112,2016,1505,"B",1.5,112,"22/06/2015 20:35:18.393","A","02050907","A_SIGA","2","23/06/2015 02:34:42.186","02050907",null,"0",0,0,0,0,"N",0,"UNIDAD",112,null,"UNIDAD",0,null,"710300010045",null,"710300010045","CINTA ADHESIVA TRANSPARENTE 2 in X 40 yd","UNIDAD",1.5]
["0048","CINTA ADHESIVA TRANSPARENTE 1/2 in X 72 yd",112,"A","71","03","0001","A",112,2016,1004,"B",3.1859999999999999,112,"03/06/2015 10:58:38.11","A","04744514","A_SIGA","2","08/06/2015 14:53:26.64","01980772",null,"0",0,0,0,0,"N",0,"UNIDAD",112,null,"UNIDAD",0,null,"710300010048",null,"710300010048","CINTA ADHESIVA TRANSPARENTE 1/2 in X 72 yd","UNIDAD",3.1859999999999999]
["0057","GOMA EN BARRA X 40 g APROX.",112,"A","71","03","0006","A",112,2016,1004,"B",8,112,"03/06/2015 10:58:38.11","A","04744514","A_SIGA","2","08/06/2015 14:53:26.64","01980772",null,"0",0,0,0,0,"N",0,"UNIDAD",112,null,"UNIDAD",0,null,"710300060057",null,"710300060057","GOMA EN BARRA X 40 g APROX.","UNIDAD",8]
["0084","GOMA EN BARRA X 21 g APROX.",112,"A","71","03","0006","A",112,2016,1004,"B",1.5104,112,"03/06/2015 10:58:38.11","A","04744514","A_SIGA","2","08/06/2015 14:53:26.64","01980772",null,"0",0,0,0,0,"N",0,"UNIDAD",112,null,"UNIDAD",0,null,"710300060084",null,"710300060084","GOMA EN BARRA X 21 g APROX.","UNIDAD",1.5104]
["0096","GOMA ESCARCHADA X 10 mL",112,"A","71","03","0006","A",112,2016,1004,"B",1.0855999999999999,112,"18/06/2015 10:00:33.72","A","04744514","A_SIGA","2","18/06/2015 10:00:33.72","04744514",null,"0",0,0,0,0,"N",0,"UNIDAD",112,null,"UNIDAD",0,null,"710300060096",null,"710300060096","GOMA ESCARCHADA X 10 mL","UNIDAD",1.0855999999999999]
["0173","NOTA AUTOADHESIVA 3 in X 3 in (7.6 cm X 7.6 cm) APROX. X 100 HOJAS X 5 VARIOS COLORES",112,"A","71","03","0012","A",112,2016,1004,"B",2.242,112,"18/06/2015 10:00:33.72","A","04744514","A_SIGA","2","18/06/2015 10:00:33.72","04744514",null,"0",0,0,0,0,"N",0,"UNIDAD",112,null,"UNIDAD",0,null,"710300120173",null,"710300120173","NOTA AUTOADHESIVA 3 in X 3 in (7.6 cm X 7.6 cm) APROX. X 100 HOJAS X 5 VARIOS COLORES","UNIDAD",2.242]
["0005","CINTA DE PAPEL PARA ENMASCARAR - MASKING TAPE 2 in X 55 yd",112,"A","71","03","0016","A",112,2016,1004,"B",6.12,112,"03/06/2015 10:58:38.11","A","04744514","A_SIGA","2","08/06/2015 14:53:26.64","01980772",null,"0",0,0,0,0,"N",0,"UNIDAD",112,null,"UNIDAD",0,null,"710300160005",null,"710300160005","CINTA DE PAPEL PARA ENMASCARAR - MASKING TAPE 2 in X 55 yd","UNIDAD",6.12]
["0006","CINTA DE PAPEL PARA ENMASCARAR - MASKING TAPE 2 in X 40 yd",112,"A","71","03","0016","A",112,2016,1004,"B",1.77,112,"18/06/2015 10:00:33.72","A","04744514","A_SIGA","2","18/06/2015 10:00:33.72","04744514",null,"0",0,0,0,0,"N",0,"UNIDAD",112,null,"UNIDAD",0,null,"710300160006",null,"710300160006","CINTA DE PAPEL PARA ENMASCARAR - MASKING TAPE 2 in X 40 yd","UNIDAD",1.77]
["0011","CINTA DE PAPEL PARA ENMASCARAR - MASKING TAPE 1 in X 40 yd",112,"A","71","03","0016","A",112,2016,1505,"B",5.9,112,"04/06/2015 21:59:24.516","A","02050907","A_SIGA","2","08/06/2015 02:32:33.403","02050907",null,"0",0,0,0,0,"N",0,"UNIDAD",112,null,"UNIDAD",0,null,"710300160011",null,"710300160011","CINTA DE PAPEL PARA ENMASCARAR - MASKING TAPE 1 in X 40 yd","UNIDAD",5.9]
["0013","CINTA DE PAPEL PARA ENMASCARAR - MASKING TAPE 1 1/2 in X 40 yd",112,"A","71","03","0016","A",112,2016,1004,"B",0.97,112,"03/06/2015 10:58:38.11","A","04744514","A_SIGA","2","08/06/2015 14:53:26.64","01980772",null,"0",0,0,0,0,"N",0,"UNIDAD",112,null,"UNIDAD",0,null,"710300160013",null,"710300160013","CINTA DE PAPEL PARA ENMASCARAR - MASKING TAPE 1 1/2 in X 40 yd","UNIDAD",0.97]
["0012","ARCHIVADOR DE CARTON CON PALANCA LOMO ANCHO TAMAÑO OFICIO",112,"A","71","06","0001","A",112,2016,1004,"B",3.6579999999999999,112,"23/06/2015 10:34:13.983","A","04744514","A_SIGA","2","23/06/2015 10:34:13.983","04744514",null,"0",0,0,0,0,"N",0,"UNIDAD",112,null,"UNIDAD",null,null,"710600010012",null,"710600010012","ARCHIVADOR DE CARTON CON PALANCA LOMO ANCHO TAMAÑO OFICIO","UNIDAD",3.6579999999999999]
["0070","ARCHIVADOR DE CARTON CON PALANCA LOMO ANCHO TAMAÑO A4",112,"A","71","06","0001","A",112,2016,1505,"B",4.9000000000000004,112,"04/06/2015 21:59:24.516","A","02050907","A_SIGA","2","08/06/2015 02:32:33.403","02050907",null,"0",0,0,0,0,"N",0,"UNIDAD",112,null,"UNIDAD",0,null,"710600010070",null,"710600010070","ARCHIVADOR DE CARTON CON PALANCA LOMO ANCHO TAMAÑO A4","UNIDAD",4.9000000000000004]
["0071","ARCHIVADOR DE CARTON CON PALANCA LOMO ANGOSTO TAMAÑO A4",112,"A","71","06","0001","A",112,2016,1004,"B",3.23,112,"03/06/2015 10:58:38.11","A","04744514","A_SIGA","2","08/06/2015 14:53:26.64","01980772",null,"0",0,0,0,0,"N",0,"UNIDAD",112,null,"UNIDAD",0,null,"710600010071",null,"710600010071","ARCHIVADOR DE CARTON CON PALANCA LOMO ANGOSTO TAMAÑO A4","UNIDAD",3.23]
["0091","ARCHIVADOR DE CARTON PLASTIFICADO CON PALANCA LOMO ANCHO 24 cm X 34 cm",112,"A","71","06","0001","A",112,2016,1004,"B",5.8,112,"03/06/2015 10:58:38.11","A","04744514","A_SIGA","2","08/06/2015 14:53:26.64","01980772",null,"0",0,0,0,0,"N",0,"UNIDAD",112,null,"UNIDAD",0,null,"710600010091",null,"710600010091","ARCHIVADOR DE CARTON PLASTIFICADO CON PALANCA LOMO ANCHO 24 cm X 34 cm","UNIDAD",5.8]
["0024","FOLDER MANILA TAMAÑO  A4",447,"A","71","06","0004","A",447,2016,1505,"B",7.5,447,"04/06/2015 21:59:24.516","A","02050907","A_SIGA","2","08/06/2015 02:32:33.403","02050907",null,"0",0,0,0,0,"N",0,"EMPAQUE X 25",447,null,"EMPAQUE X 25",0,null,"710600040024",null,"710600040024","FOLDER MANILA TAMAÑO  A4","EMPAQUE X 25",7.5]
["0032","FOLDER MANILA TAMAÑO A4 CON REFUERZO",112,"A","71","06","0004","A",112,2016,1004,"B",4.4603999999999999,112,"03/06/2015 10:58:38.11","A","04744514","A_SIGA","2","08/06/2015 14:53:26.64","01980772",null,"0",0,0,0,0,"N",0,"UNIDAD",112,null,"UNIDAD",0,null,"710600040032",null,"710600040032","FOLDER MANILA TAMAÑO A4 CON REFUERZO","UNIDAD",4.4603999999999999]
["0036","FOLDER MANILA TAMAÑO A4 CON FASTENER DE METAL",112,"A","71","06","0004","A",112,2016,1004,"B",0.5,112,"03/06/2015 10:58:38.11","A","04744514","A_SIGA","2","08/06/2015 14:53:26.64","01980772",null,"0",0,0,0,0,"N",0,"UNIDAD",112,null,"UNIDAD",0,null,"710600040036",null,"710600040036","FOLDER MANILA TAMAÑO A4 CON FASTENER DE METAL","UNIDAD",0.5]
["0040","FOLDER MANILA TAMAÑO OFICIO CON  REFUERZO",447,"A","71","06","0004","A",447,2016,1004,"B",4.13,447,"03/06/2015 10:58:38.11","A","04744514","A_SIGA","2","08/06/2015 14:53:26.64","01980772",null,"0",0,0,0,0,"N",0,"EMPAQUE X 25",447,null,"EMPAQUE X 25",0,null,"710600040040",null,"710600040040","FOLDER MANILA TAMAÑO OFICIO CON  REFUERZO","EMPAQUE X 25",4.13]
["0043","FOLDER MANILA  TAMAÑO A4",452,"A","71","06","0004","A",452,2016,1505,"B",7.5,452,"17/06/2015 20:52:28.193","A","02050907","A_SIGA","2","18/06/2015 20:51:35.89","02050907",null,"0",0,0,0,0,"N",0,"EMPAQUE X 500",452,null,"EMPAQUE X 500",0,null,"710600040043",null,"710600040043","FOLDER MANILA  TAMAÑO A4","EMPAQUE X 500",7.5]
["0010","FOLDER DE PLASTICO CON SUJETADOR SUPERIOR TAMAÑO OFICIO",112,"A","71","06","0005","A",112,2016,1004,"B",6.5372000000000003,112,"03/06/2015 10:58:38.11","A","04744514","A_SIGA","2","08/06/2015 14:53:26.64","01980772",null,"0",0,0,0,0,"N",0,"UNIDAD",112,null,"UNIDAD",null,null,"710600050010",null,"710600050010","FOLDER DE PLASTICO CON SUJETADOR SUPERIOR TAMAÑO OFICIO","UNIDAD",6.5372000000000003]
["0005","FORRO DE PLASTICO TAMAÑO OFICIO",112,"A","71","06","0006","A",112,2016,1505,"B",8.9,112,"17/06/2015 20:52:28.193","A","02050907","A_SIGA","2","18/06/2015 20:51:35.89","02050907",null,"0",0,0,0,0,"N",0,"UNIDAD",112,null,"UNIDAD",null,null,"710600060005",null,"710600060005","FORRO DE PLASTICO TAMAÑO OFICIO","UNIDAD",8.9]
["0016","FORRO DE PLASTICO TAMAÑO A4",112,"A","71","06","0006","A",112,2016,1505,"B",8.9,112,"04/06/2015 21:59:24.516","A","02050907","A_SIGA","2","08/06/2015 02:32:33.403","02050907",null,"0",0,0,0,0,"N",0,"UNIDAD",112,null,"UNIDAD",0,null,"710600060016",null,"710600060016","FORRO DE PLASTICO TAMAÑO A4","UNIDAD",8.9]
["0044","FORRO DE PLASTICO TRANSPARENTE TAMAÑO OFICIO X 5 m",112,"A","71","06","0006","A",112,2016,1004,"B",0.99119999999999997,112,"18/06/2015 10:00:33.72","A","04744514","A_SIGA","2","18/06/2015 10:00:33.72","04744514",null,"0",0,0,0,0,"N",0,"UNIDAD",112,null,"UNIDAD",0,null,"710600060044",null,"710600060044","FORRO DE PLASTICO TRANSPARENTE TAMAÑO OFICIO X 5 m","UNIDAD",0.99119999999999997]
["0047","FORRO DE PLÁSTICO AUTOADHESIVO TRANSPARENTE TAMAÑO A4 X 10",112,"A","71","06","0006","A",112,2016,1004,"B",7.2,112,"23/06/2015 10:34:13.983","A","04744514","A_SIGA","2","23/06/2015 10:34:13.983","04744514",null,"0",0,0,0,0,"N",0,"UNIDAD",112,null,"UNIDAD",0,null,"710600060047",null,"710600060047","FORRO DE PLÁSTICO AUTOADHESIVO TRANSPARENTE TAMAÑO A4 X 10","UNIDAD",7.2]
["0056","SOBRE MANILA DE 90 g TAMAÑO OFICIO",112,"A","71","06","0010","A",112,2016,1004,"B",0.28000000000000003,112,"04/06/2015 15:07:32.983","A","01980772","ESCAL1","2","08/06/2015 14:53:26.64","01980772",null,"0",0,0,0,0,"N",0,"UNIDAD",112,null,"UNIDAD",0,null,"710600100056",null,"710600100056","SOBRE MANILA DE 90 g TAMAÑO OFICIO","UNIDAD",0.28000000000000003]
["0195","SOBRE MANILA  DE 90 g TAMAÑO A4",449,"A","71","06","0010","A",449,2016,1505,"B",9.5,449,"17/06/2015 20:52:28.193","A","02050907","A_SIGA","2","18/06/2015 20:51:35.89","02050907",null,"0",0,0,0,0,"N",0,"EMPAQUE X 50",449,null,"EMPAQUE X 50",0,null,"710600100195",null,"710600100195","SOBRE MANILA  DE 90 g TAMAÑO A4","EMPAQUE X 50",9.5]
["0216","SOBRE MANILA  TAMAÑO A4",112,"A","71","06","0010","A",112,2016,1505,"B",0.22,112,"21/06/2015 21:57:51.323","A","02050907","A_SIGA","2","21/06/2015 21:57:51.323","02050907",null,"0",0,0,0,0,"N",0,"UNIDAD",112,null,"UNIDAD",0,null,"710600100216",null,"710600100216","SOBRE MANILA  TAMAÑO A4","UNIDAD",0.22]
["0234","SOBRE MANILA TAMAÑO  A4",449,"A","71","06","0010","A",449,2016,1004,"B",8.673,449,"04/06/2015 15:07:32.983","A","01980772","ESCAL1","2","08/06/2015 14:53:26.64","01980772",null,"0",0,0,0,0,"N",0,"EMPAQUE X 50",449,null,"EMPAQUE X 50",0,null,"710600100234",null,"710600100234","SOBRE MANILA TAMAÑO  A4","EMPAQUE X 50",8.673]
["0238","SOBRE MANILA  TAMAÑO  OFICIO",449,"A","71","06","0010","A",449,2016,1505,"B",7.19,449,"17/06/2015 20:52:28.193","A","02050907","A_SIGA","2","18/06/2015 20:51:35.89","02050907",null,"0",0,0,0,0,"N",0,"EMPAQUE X 50",449,null,"EMPAQUE X 50",0,null,"710600100238",null,"710600100238","SOBRE MANILA  TAMAÑO  OFICIO","EMPAQUE X 50",7.19]
["0265","SOBRE MANILA DE 90 g  TAMAÑO A4",339,"A","71","06","0010","A",339,2016,1505,"B",95,339,"04/06/2015 21:59:24.516","A","02050907","A_SIGA","2","18/06/2015 20:51:35.89","02050907",null,"0",0,0,0,9.5,"N",0,"CIENTO",339,null,"CIENTO",0,null,"710600100265",null,"710600100265","SOBRE MANILA DE 90 g  TAMAÑO A4","CIENTO",95]
["0346","SOBRE MANILA DE 75 g TAMAÑO 29 cm X 44 cm",112,"A","71","06","0010","A",112,2016,1004,"B",2.5,112,"04/06/2015 15:07:32.983","A","01980772","ESCAL1","2","08/06/2015 14:53:26.64","01980772",null,"0",0,0,0,0,"N",0,"UNIDAD",112,null,"UNIDAD",0,null,"710600100346",null,"710600100346","SOBRE MANILA DE 75 g TAMAÑO 29 cm X 44 cm","UNIDAD",2.5]
["0096","FOLDER PORTA DOCUMENTO TIPO CARPETA DE CARTON PLASTIFICADO CON LIGA TAMAÑO OFICIO",112,"A","71","06","0014","A",112,2016,1004,"B",3.6579999999999999,112,"18/06/2015 10:00:33.72","A","04744514","A_SIGA","2","18/06/2015 10:00:33.72","04744514",null,"0",0,0,0,0,"N",0,"UNIDAD",112,null,"UNIDAD",0,null,"710600140096",null,"710600140096","FOLDER PORTA DOCUMENTO TIPO CARPETA DE CARTON PLASTIFICADO CON LIGA TAMAÑO OFICIO","UNIDAD",3.6579999999999999]
["0007","BORRADOR MIXTO TAMAÑO CHICO",112,"A","71","11","0001","A",112,2016,1004,"B",0.29499999999999998,112,"03/06/2015 10:58:38.11","A","04744514","A_SIGA","2","08/06/2015 14:53:26.64","01980772",null,"0",0,0,0,0,"N",0,"UNIDAD",112,null,"UNIDAD",null,null,"711100010007",null,"711100010007","BORRADOR MIXTO TAMAÑO CHICO","UNIDAD",0.29499999999999998]
["0008","BORRADOR MIXTO TAMAÑO GRANDE",112,"A","71","11","0001","A",112,2016,1505,"B",0.8,112,"04/06/2015 21:59:24.516","A","02050907","A_SIGA","2","08/06/2015 02:32:33.403","02050907",null,"0",0,0,0,0,"N",0,"UNIDAD",112,null,"UNIDAD",null,null,"711100010008",null,"711100010008","BORRADOR MIXTO TAMAÑO GRANDE","UNIDAD",0.8]
["0005","CORRECTOR LIQUIDO TIPO LAPICERO",112,"A","71","11","0003","A",112,2016,1505,"B",2.5,112,"04/06/2015 21:59:24.516","A","02050907","A_SIGA","2","08/06/2015 02:32:33.403","02050907",null,"0",0,0,0,0,"N",0,"UNIDAD",112,null,"UNIDAD",0,null,"711100030005",null,"711100030005","CORRECTOR LIQUIDO TIPO LAPICERO","UNIDAD",2.5]
["0004","CINTA DE ALGODON PARA MAQUINA DE ESCRIBIR MECANICA COLOR",112,"A","71","19","0001","A",112,2016,1004,"B",2.9820000000000002,112,"03/06/2015 10:58:38.11","A","04744514","A_SIGA","2","23/06/2015 10:34:13.983","04744514",null,"0",0,0,0,0,"N",0,"UNIDAD",112,null,"UNIDAD",0,null,"711900010004",null,"711900010004","CINTA DE ALGODON PARA MAQUINA DE ESCRIBIR MECANICA COLOR","UNIDAD",2.9820000000000002]
["0049","AGENDA IMPRESA TAMAÑO A5",112,"A","71","50","0001","A",112,2016,1004,"B",25,112,"18/06/2015 10:00:33.72","A","04744514","A_SIGA","2","18/06/2015 10:00:33.72","04744514",null,"0",0,0,0,0,"N",0,"UNIDAD",112,null,"UNIDAD",0,null,"715000010049",null,"715000010049","AGENDA IMPRESA TAMAÑO A5","UNIDAD",25]
["0005","ENGRAPADOR GRANDE DE OFICINA (100 HOJAS)",112,"A","71","50","0011","A",112,2016,1004,"B",57.570999999999998,112,"03/06/2015 10:58:38.11","A","04744514","A_SIGA","2","08/06/2015 14:53:26.64","01980772",null,"0",0,0,0,0,"N",0,"UNIDAD",112,null,"UNIDAD",null,null,"715000110005",null,"715000110005","ENGRAPADOR GRANDE DE OFICINA (100 HOJAS)","UNIDAD",57.570999999999998]
["0041","ENGRAPADOR CHICO DE OFICINA CON YUNQUE GIRATORIO",112,"A","71","50","0011","A",112,2016,1505,"B",19,112,"04/06/2015 21:59:24.516","A","02050907","A_SIGA","2","08/06/2015 02:32:33.403","02050907",null,"0",0,0,0,0,"N",0,"UNIDAD",112,null,"UNIDAD",0,null,"715000110041",null,"715000110041","ENGRAPADOR CHICO DE OFICINA CON YUNQUE GIRATORIO","UNIDAD",19]
["0059","ENGRAPADOR TIPO ALICATE CON YUNQUE FIJO",112,"A","71","50","0011","A",112,2016,1004,"B",6.9619999999999997,112,"03/06/2015 10:58:38.11","A","04744514","A_SIGA","2","08/06/2015 14:53:26.64","01980772",null,"0",0,0,0,0,"N",0,"UNIDAD",112,null,"UNIDAD",0,null,"715000110059",null,"715000110059","ENGRAPADOR TIPO ALICATE CON YUNQUE FIJO","UNIDAD",6.9619999999999997]
["0061","ENGRAPADOR DE METAL TIPO ALICATE CON YUNQUE GIRATORIO",112,"A","71","50","0011","A",112,2016,1004,"B",11.2,112,"03/06/2015 10:58:38.11","A","04744514","A_SIGA","2","08/06/2015 14:53:26.64","01980772",null,"0",0,0,0,0,"N",0,"UNIDAD",112,null,"UNIDAD",0,null,"715000110061",null,"715000110061","ENGRAPADOR DE METAL TIPO ALICATE CON YUNQUE GIRATORIO","UNIDAD",11.2]
["0010","PERFORADOR DE 2 ESPIGAS PARA 15 A 20 HOJAS",112,"A","71","50","0012","A",112,2016,1004,"B",7.7880000000000003,112,"03/06/2015 15:28:35.876","A","01980772","ESCAL1","2","08/06/2015 14:53:26.64","01980772",null,"0",0,0,0,0,"N",0,"UNIDAD",112,null,"UNIDAD",null,null,"715000120010",null,"715000120010","PERFORADOR DE 2 ESPIGAS PARA 15 A 20 HOJAS","UNIDAD",7.7880000000000003]
["0052","PERFORADOR DE 2 ESPIGAS PARA 10 A 15 HOJAS",112,"A","71","50","0012","A",112,2016,1505,"B",19,112,"04/06/2015 21:59:24.516","A","02050907","A_SIGA","2","08/06/2015 02:32:33.403","02050907",null,"0",0,0,0,0,"N",0,"UNIDAD",112,null,"UNIDAD",0,null,"715000120052",null,"715000120052","PERFORADOR DE 2 ESPIGAS PARA 10 A 15 HOJAS","UNIDAD",19]
["0018","PORTA LAPICERO ACRILICO TIPO CUBO",112,"A","71","50","0014","A",112,2016,1004,"B",2.1358000000000001,112,"04/06/2015 15:07:32.983","A","01980772","ESCAL1","2","08/06/2015 14:53:26.64","01980772",null,"0",0,0,0,0,"N",0,"UNIDAD",112,null,"UNIDAD",0,null,"715000140018",null,"715000140018","PORTA LAPICERO ACRILICO TIPO CUBO","UNIDAD",2.1358000000000001]
["0002","PORTA CLIPS ACRILICO CON IMAN",112,"A","71","50","0015","A",112,2016,1004,"B",2.39,112,"04/06/2015 15:07:32.983","A","01980772","ESCAL1","2","08/06/2015 14:53:26.64","01980772",null,"0",0,0,0,0,"N",0,"UNIDAD",112,null,"UNIDAD",null,null,"715000150002",null,{"$f":"+AJ195","v":"715000150002"},{"$f":"+B195","v":"PORTA CLIPS ACRILICO CON IMAN"},{"$f":"+AG195","v":"UNIDAD"},{"$f":"+M195","v":2.39}]
["0011","PORTA CLIPS DE ACRILICO FORMA OVALADA",112,"A","71","50","0015","A",112,2016,1004,"B",3.8,112,"04/06/2015 15:07:32.983","A","01980772","ESCAL1","2","08/06/2015 14:53:26.64","01980772",null,"0",0,0,0,0,"N",0,"UNIDAD",112,null,"UNIDAD",0,null,"715000150011",null,"715000150011","PORTA CLIPS DE ACRILICO FORMA OVALADA","UNIDAD",3.8]
["0001","REGLA DE PLASTICO 30 cm",112,"A","71","50","0019","A",112,2016,1505,"B",0.9,112,"04/06/2015 21:59:24.516","A","02050907","A_SIGA","2","08/06/2015 02:32:33.403","02050907",null,"0",0,0,0,0,"N",0,"UNIDAD",112,null,"UNIDAD",null,null,"715000190001",null,"715000190001","REGLA DE PLASTICO 30 cm","UNIDAD",0.9]
["0020","REGLA DE PLASTICO 20 cm",112,"A","71","50","0019","A",112,2016,1004,"B",1.46,112,"04/06/2015 15:07:32.983","A","01980772","ESCAL1","2","08/06/2015 14:53:26.64","01980772",null,"0",0,0,0,0,"N",0,"UNIDAD",112,null,"UNIDAD",null,null,"715000190020",null,"715000190020","REGLA DE PLASTICO 20 cm","UNIDAD",1.46]
["0022","REGLA DE PLASTICO 60 cm",112,"A","71","50","0019","A",112,2016,1004,"B",6.9,112,"04/06/2015 15:07:32.983","A","01980772","ESCAL1","2","08/06/2015 14:53:26.64","01980772",null,"0",0,0,0,0,"N",0,"UNIDAD",112,null,"UNIDAD",null,null,"715000190022",null,"715000190022","REGLA DE PLASTICO 60 cm","UNIDAD",6.9]
["0006","SACAGRAPA DE METAL",112,"A","71","50","0020","A",112,2016,1505,"B",1.05,112,"17/06/2015 20:52:28.193","A","02050907","A_SIGA","2","18/06/2015 20:51:35.89","02050907",null,"0",0,0,0,0,"N",0,"UNIDAD",112,null,"UNIDAD",0,null,"715000200006",null,"715000200006","SACAGRAPA DE METAL","UNIDAD",1.05]
["0026","TABLERO ACRILICO TAMAÑO OFICIO CON SUJETADOR DE METAL",112,"A","71","50","0021","A",112,2016,1004,"B",6.431,112,"04/06/2015 15:07:32.983","A","01980772","ESCAL1","2","08/06/2015 14:53:26.64","01980772",null,"0",0,0,0,0,"N",0,"UNIDAD",112,null,"UNIDAD",0,null,"715000210026",null,"715000210026","TABLERO ACRILICO TAMAÑO OFICIO CON SUJETADOR DE METAL","UNIDAD",6.431]
["0001","TAJADOR DE BOLSILLO CON DEPOSITO",112,"A","71","50","0022","A",112,2016,1004,"B",1.1399999999999999,112,"23/06/2015 10:34:13.983","A","04744514","A_SIGA","2","23/06/2015 10:34:13.983","04744514",null,"0",0,0,0,0,"N",0,"UNIDAD",112,null,"UNIDAD",null,null,"715000220001",null,"715000220001","TAJADOR DE BOLSILLO CON DEPOSITO","UNIDAD",1.1399999999999999]
["0021","TAJADOR DE MESA DE METAL",112,"A","71","50","0022","A",112,2016,1004,"B",2.8,112,"18/06/2015 10:00:33.72","A","04744514","A_SIGA","2","18/06/2015 10:00:33.72","04744514",null,"0",0,0,0,0,"N",0,"UNIDAD",112,null,"UNIDAD",0,null,"715000220021",null,"715000220021","TAJADOR DE MESA DE METAL","UNIDAD",2.8]
["0022","TAJADOR DE MESA ACRILICO",112,"A","71","50","0022","A",112,2016,1004,"B",35,112,"23/06/2015 10:34:13.983","A","04744514","A_SIGA","2","23/06/2015 10:34:13.983","04744514",null,"0",0,0,0,0,"N",0,"UNIDAD",112,null,"UNIDAD",0,null,"715000220022",null,"715000220022","TAJADOR DE MESA ACRILICO","UNIDAD",35]
["0041","TIJERA DE METAL DE 7 in CON MANGO DE PLASTICO",112,"A","71","50","0023","A",112,2016,1004,"B",7,112,"18/06/2015 10:00:33.72","A","04744514","A_SIGA","2","18/06/2015 10:00:33.72","04744514",null,"0",0,0,0,0,"N",0,"UNIDAD",112,null,"UNIDAD",0,null,"715000230041",null,"715000230041","TIJERA DE METAL DE 7 in CON MANGO DE PLASTICO","UNIDAD",7]
["0042","TIJERA DE METAL DE 8 in CON MANGO DE PLASTICO",112,"A","71","50","0023","A",112,2016,1505,"B",2.42,112,"17/06/2015 20:52:28.193","A","02050907","A_SIGA","2","18/06/2015 20:51:35.89","02050907",null,"0",0,0,0,0,"N",0,"UNIDAD",112,null,"UNIDAD",0,null,"715000230042",null,"715000230042","TIJERA DE METAL DE 8 in CON MANGO DE PLASTICO","UNIDAD",2.42]
["0047","TIJERA DE METAL DE FORMAS DIVERSAS PARA DISEÑO",112,"A","71","50","0023","A",112,2016,1004,"B",1.8,112,"23/06/2015 10:34:13.983","A","04744514","A_SIGA","2","23/06/2015 10:34:13.983","04744514",null,"0",0,0,0,0,"N",0,"UNIDAD",112,null,"UNIDAD",0,null,"715000230047",null,"715000230047","TIJERA DE METAL DE FORMAS DIVERSAS PARA DISEÑO","UNIDAD",1.8]
["0050","TIJERA DE METAL DE 5 in CON PUNTA ROMA Y MANGO DE PLASTICO",112,"A","71","50","0023","A",112,2016,1505,"B",1.95,112,"17/06/2015 20:52:28.193","A","02050907","A_SIGA","2","18/06/2015 20:51:35.89","02050907",null,"0",0,0,0,0,"N",0,"UNIDAD",112,null,"UNIDAD",0,null,"715000230050",null,"715000230050","TIJERA DE METAL DE 5 in CON PUNTA ROMA Y MANGO DE PLASTICO","UNIDAD",1.95]
["0018","PORTA DISKETTE ACRILICO DE 3.5 in PARA 5",112,"A","71","50","0026","A",112,2016,1004,"B",4,112,"04/06/2015 15:07:32.983","A","01980772","ESCAL1","2","08/06/2015 14:53:26.64","01980772",null,"0",0,0,0,0,"N",0,"UNIDAD",112,null,"UNIDAD",0,null,"715000260018",null,"715000260018","PORTA DISKETTE ACRILICO DE 3.5 in PARA 5","UNIDAD",4]
["0020","DISPENSADOR DE CINTA ADHESIVA DE 72 yd",112,"A","71","50","0030","A",112,2016,1004,"B",8.0239999999999991,112,"03/06/2015 10:58:38.11","A","04744514","A_SIGA","2","08/06/2015 14:53:26.64","01980772",null,"0",0,0,0,0,"N",0,"UNIDAD",112,null,"UNIDAD",0,null,"715000300020",null,"715000300020","DISPENSADOR DE CINTA ADHESIVA DE 72 yd","UNIDAD",8.0239999999999991]
["0031","DISPENSADOR DE CINTA ADHESIVA CON ADAPTADOR DE 36 yd Y 72 yd",112,"A","71","50","0030","A",112,2016,1004,"B",12,112,"03/06/2015 10:58:38.11","A","04744514","A_SIGA","2","08/06/2015 14:53:26.64","01980772",null,"0",0,0,0,0,"N",0,"UNIDAD",112,null,"UNIDAD",0,null,"715000300031",null,"715000300031","DISPENSADOR DE CINTA ADHESIVA CON ADAPTADOR DE 36 yd Y 72 yd","UNIDAD",12]
["0027","CUCHILLA PARA CORTAR PAPEL CON MANGO DE PLASTICO",112,"A","71","50","0032","A",112,2016,1505,"B",0.89,112,"17/06/2015 20:52:28.193","A","02050907","A_SIGA","2","18/06/2015 20:51:35.89","02050907",null,"0",0,0,0,0,"N",0,"UNIDAD",112,null,"UNIDAD",0,null,{"$f":"CONCATENATE(E212,F212,G212,A212)","v":"715000320027"},null,"715000320027","CUCHILLA PARA CORTAR PAPEL CON MANGO DE PLASTICO","UNIDAD",0.89]
["0033","CUCHILLA PARA CORTAR PAPEL 10 mm",112,"A","71","50","0032","A",112,2016,1004,"B",1,112,"23/06/2015 10:34:13.983","A","04744514","A_SIGA","2","23/06/2015 10:34:13.983","04744514",null,"0",0,0,0,0,"N",0,"UNIDAD",112,null,"UNIDAD",0,null,"715000320033",null,"715000320033","CUCHILLA PARA CORTAR PAPEL 10 mm","UNIDAD",1]
["0001","MOTA PARA PIZARRA ACRILICA",112,"A","71","50","0044","A",112,2016,1505,"B",3,112,"17/06/2015 20:52:28.193","A","02050907","A_SIGA","2","18/06/2015 20:51:35.89","02050907",null,"0",0,0,0,0,"N",0,"UNIDAD",112,null,"UNIDAD",0,null,"715000440001",null,"715000440001","MOTA PARA PIZARRA ACRILICA","UNIDAD",3]
["0001","BOLIGRAFO (LAPICERO) DE TINTA LIQUIDA PUNTA FINA COLOR  NEGRO",112,"A","71","60","0001","A",112,2016,1004,"B",2.3954,112,"03/06/2015 10:58:38.11","A","04744514","A_SIGA","2","08/06/2015 14:53:26.64","01980772",null,"0",0,0,0,0,"N",0,"UNIDAD",112,null,"UNIDAD",null,null,"716000010001",null,"716000010001","BOLIGRAFO (LAPICERO) DE TINTA LIQUIDA PUNTA FINA COLOR  NEGRO","UNIDAD",2.3954]
["0002","BOLIGRAFO (LAPICERO) DE TINTA LIQUIDA PUNTA FINA COLOR  ROJO",112,"A","71","60","0001","A",112,2016,1505,"B",3.3,112,"04/06/2015 21:59:24.516","A","02050907","A_SIGA","2","08/06/2015 02:32:33.403","02050907",null,"0",0,0,0,0,"N",0,"UNIDAD",112,null,"UNIDAD",null,null,"716000010002",null,"716000010002","BOLIGRAFO (LAPICERO) DE TINTA LIQUIDA PUNTA FINA COLOR  ROJO","UNIDAD",3.3]
["0022","BOLIGRAFO (LAPICERO) DE TINTA LIQUIDA PUNTA FINA COLOR  AZUL",112,"A","71","60","0001","A",112,2016,1505,"B",3.3,112,"04/06/2015 21:59:24.516","A","02050907","A_SIGA","2","08/06/2015 02:32:33.403","02050907",null,"0",0,0,0,0,"N",0,"UNIDAD",112,null,"UNIDAD",null,null,"716000010022",null,"716000010022","BOLIGRAFO (LAPICERO) DE TINTA LIQUIDA PUNTA FINA COLOR  AZUL","UNIDAD",3.3]
["0187","BOLIGRAFO (LAPICERO) DE TINTA SECA PUNTA FINA COLOR ROJO",112,"A","71","60","0001","A",112,2016,1505,"B",0.8,112,"04/06/2015 21:59:24.516","A","02050907","A_SIGA","2","08/06/2015 02:32:33.403","02050907",null,"0",0,0,0,0,"N",0,"UNIDAD",112,null,"UNIDAD",0,null,"716000010187",null,"716000010187","BOLIGRAFO (LAPICERO) DE TINTA SECA PUNTA FINA COLOR ROJO","UNIDAD",0.8]
["0195","BOLIGRAFO (LAPICERO) DE TINTA SECA PUNTA FINA",112,"A","71","60","0001","A",112,2016,1004,"B",0.4012,112,"03/06/2015 10:58:38.11","A","04744514","A_SIGA","2","08/06/2015 14:53:26.64","01980772",null,"0",0,0,0,0,"N",0,"UNIDAD",112,null,"UNIDAD",0,null,"716000010195",null,"716000010195","BOLIGRAFO (LAPICERO) DE TINTA SECA PUNTA FINA","UNIDAD",0.4012]
["0198","BOLIGRAFO (LAPICERO) DE TINTA LIQUIDA PUNTA FINA",112,"A","71","60","0001","A",112,2016,1505,"B",3.3,112,"04/06/2015 21:59:24.516","A","02050907","A_SIGA","2","08/06/2015 02:32:33.403","02050907",null,"0",0,0,0,0,"N",0,"UNIDAD",112,null,"UNIDAD",0,null,"716000010198",null,"716000010198","BOLIGRAFO (LAPICERO) DE TINTA LIQUIDA PUNTA FINA","UNIDAD",3.3]
["0201","BOLIGRAFO (LAPICERO) FINO TIPO EJECUTIVO DE TINTA SECA PUNTA MEDIA",112,"A","71","60","0001","A",112,2016,1004,"B",36,112,"18/06/2015 10:00:33.72","A","04744514","A_SIGA","2","18/06/2015 10:00:33.72","04744514",null,"0",0,0,0,0,"N",0,"UNIDAD",112,null,"UNIDAD",0,null,"716000010201",null,"716000010201","BOLIGRAFO (LAPICERO) FINO TIPO EJECUTIVO DE TINTA SECA PUNTA MEDIA","UNIDAD",36]
["0208","BOLIGRAFO (LAPICERO) DE TINTA SECA PUNTA FINA COLOR  AZUL",112,"A","71","60","0001","A",112,2016,1505,"B",0.8,112,"04/06/2015 21:59:24.516","A","02050907","A_SIGA","2","08/06/2015 02:32:33.403","02050907",null,"0",0,0,0,0,"N",0,"UNIDAD",112,null,"UNIDAD",null,null,"716000010208",null,"716000010208","BOLIGRAFO (LAPICERO) DE TINTA SECA PUNTA FINA COLOR  AZUL","UNIDAD",0.8]
["0209","BOLIGRAFO (LAPICERO) DE TINTA SECA PUNTA FINA COLOR  NEGRO",112,"A","71","60","0001","A",112,2016,1505,"B",0.8,112,"04/06/2015 21:59:24.516","A","02050907","A_SIGA","2","08/06/2015 02:32:33.403","02050907",null,"0",0,0,0,0,"N",0,"UNIDAD",112,null,"UNIDAD",null,null,"716000010209",null,"716000010209","BOLIGRAFO (LAPICERO) DE TINTA SECA PUNTA FINA COLOR  NEGRO","UNIDAD",0.8]
["0212","BOLIGRAFO (LAPICERO) DE TINTA SECA PUNTA MEDIA COLOR  AZUL",112,"A","71","60","0001","A",112,2016,1004,"B",0.4,112,"18/06/2015 10:00:33.72","A","04744514","A_SIGA","2","18/06/2015 10:00:33.72","04744514",null,"0",0,0,0,0,"N",0,"UNIDAD",112,null,"UNIDAD",0,null,"716000010212",null,"716000010212","BOLIGRAFO (LAPICERO) DE TINTA SECA PUNTA MEDIA COLOR  AZUL","UNIDAD",0.4]
["0213","BOLIGRAFO (LAPICERO) DE TINTA SECA PUNTA MEDIA COLOR  NEGRO",112,"A","71","60","0001","A",112,2016,1004,"B",0.4,112,"18/06/2015 10:00:33.72","A","04744514","A_SIGA","2","18/06/2015 10:00:33.72","04744514",null,"0",0,0,0,0,"N",0,"UNIDAD",112,null,"UNIDAD",0,null,"716000010213",null,"716000010213","BOLIGRAFO (LAPICERO) DE TINTA SECA PUNTA MEDIA COLOR  NEGRO","UNIDAD",0.4]
["0214","BOLIGRAFO (LAPICERO) DE TINTA SECA PUNTA MEDIA COLOR  ROJO",112,"A","71","60","0001","A",112,2016,1004,"B",0.4,112,"18/06/2015 10:00:33.72","A","04744514","A_SIGA","2","18/06/2015 10:00:33.72","04744514",null,"0",0,0,0,0,"N",0,"UNIDAD",112,null,"UNIDAD",0,null,"716000010214",null,"716000010214","BOLIGRAFO (LAPICERO) DE TINTA SECA PUNTA MEDIA COLOR  ROJO","UNIDAD",0.4]
["0231","BOLIGRAFO (LAPICERO) DE TINTA LIQUIDA PUNTA MEDIA COLOR AZUL",112,"A","71","60","0001","A",112,2016,1004,"B",2.3954,112,"03/06/2015 10:58:38.11","A","04744514","A_SIGA","2","08/06/2015 14:53:26.64","01980772",null,"0",0,0,0,0,"N",0,"UNIDAD",112,null,"UNIDAD",0,null,"716000010231",null,"716000010231","BOLIGRAFO (LAPICERO) DE TINTA LIQUIDA PUNTA MEDIA COLOR AZUL","UNIDAD",2.3954]
["0307","BOLIGRAFO (LAPICERO) FINO TIPO EJECUTIVO DE TINTA LIQUIDA PUNTA FINA CON LOGOTIPO",112,"A","71","60","0001","A",112,2016,1004,"B",12,112,"18/06/2015 10:00:33.72","A","04744514","A_SIGA","2","18/06/2015 10:00:33.72","04744514",null,"0",0,0,0,0,"N",0,"UNIDAD",112,null,"UNIDAD",0,null,"716000010307",null,"716000010307","BOLIGRAFO (LAPICERO) FINO TIPO EJECUTIVO DE TINTA LIQUIDA PUNTA FINA CON LOGOTIPO","UNIDAD",12]
["0025","LAPIZ DE COLOR TAMAÑO GRANDE (JUEGO X 12 COLORES)",112,"A","71","60","0004","A",112,2016,1505,"B",6.3,112,"17/06/2015 20:52:28.193","A","02050907","A_SIGA","2","18/06/2015 20:51:35.89","02050907",null,"0",0,0,0,0,"N",0,"UNIDAD",112,null,"UNIDAD",0,null,"716000040025",null,"716000040025","LAPIZ DE COLOR TAMAÑO GRANDE (JUEGO X 12 COLORES)","UNIDAD",6.3]
["0039","LAPIZ DE COLOR TAMAÑO CHICO (JUEGO X 12 COLORES)",112,"A","71","60","0004","A",112,2016,1505,"B",4.5,112,"17/06/2015 20:52:28.193","A","02050907","A_SIGA","2","18/06/2015 20:51:35.89","02050907",null,"0",0,0,0,0,"N",0,"UNIDAD",112,null,"UNIDAD",0,null,"716000040039",null,"716000040039","LAPIZ DE COLOR TAMAÑO CHICO (JUEGO X 12 COLORES)","UNIDAD",4.5]
["0045","LAPIZ NEGRO Nº 2 CON BORRADOR",112,"A","71","60","0004","A",112,2016,1004,"B",0.2006,112,"23/06/2015 10:34:13.983","A","04744514","A_SIGA","2","23/06/2015 10:34:13.983","04744514",null,"0",0,0,0,0,"N",0,"UNIDAD",112,null,"UNIDAD",0,null,"716000040045",null,"716000040045","LAPIZ NEGRO Nº 2 CON BORRADOR","UNIDAD",0.2006]
["0047","LAPIZ NEGRO GRADO 2B",112,"A","71","60","0004","A",112,2016,1505,"B",0.66,112,"04/06/2015 21:59:24.516","A","02050907","A_SIGA","2","08/06/2015 02:32:33.403","02050907",null,"0",0,0,0,0,"N",0,"UNIDAD",112,null,"UNIDAD",0,null,"716000040047",null,"716000040047","LAPIZ NEGRO GRADO 2B","UNIDAD",0.66]
["0070","LAPIZ GRAFITO Nº 2",112,"A","71","60","0004","A",112,2016,1004,"B",0.59,112,"03/06/2015 15:28:35.876","A","01980772","ESCAL1","2","08/06/2015 14:53:26.64","01980772",null,"0",0,0,0,0,"N",0,"UNIDAD",112,null,"UNIDAD",0,null,"716000040070",null,"716000040070","LAPIZ GRAFITO Nº 2","UNIDAD",0.59]
["0009","NUMERADOR AUTOMATICO DE METAL DE 8 DIGITOS",112,"A","71","60","0005","A",112,2016,1505,"B",46.8,112,"17/06/2015 20:52:28.193","A","02050907","A_SIGA","2","18/06/2015 20:51:35.89","02050907",null,"0",0,0,0,0,"N",0,"UNIDAD",112,null,"UNIDAD",0,null,"716000050009",null,"716000050009","NUMERADOR AUTOMATICO DE METAL DE 8 DIGITOS","UNIDAD",46.8]
["0378","PLUMON PARA PIZARRA ACRILICA PUNTA GRUESA",112,"A","71","60","0006","A",112,2016,1505,"B",2.5,112,"23/06/2015 02:34:42.186","A","02050907","A_SIGA","2","23/06/2015 02:34:42.186","02050907",null,"0",0,0,0,0,"N",0,"UNIDAD",112,null,"UNIDAD",0,null,"716000060378",null,"716000060378","PLUMON PARA PIZARRA ACRILICA PUNTA GRUESA","UNIDAD",2.5]
["0379","PLUMON PARA PIZARRA ACRILICA PUNTA MEDIANA",112,"A","71","60","0006","A",112,2016,1505,"B",1.6,112,"23/06/2015 02:34:42.186","A","02050907","A_SIGA","2","23/06/2015 02:34:42.186","02050907",null,"0",0,0,0,0,"N",0,"UNIDAD",112,null,"UNIDAD",0,null,"716000060379",null,"716000060379","PLUMON PARA PIZARRA ACRILICA PUNTA MEDIANA","UNIDAD",1.6]
["0381","PLUMON MARCADOR DE TINTA AL AGUA PUNTA GRUESA",112,"A","71","60","0006","A",112,2016,1004,"B",1.3,112,"23/06/2015 10:34:13.983","A","04744514","A_SIGA","2","23/06/2015 10:34:13.983","04744514",null,"0",0,0,0,0,"N",0,"UNIDAD",112,null,"UNIDAD",0,null,"716000060381",null,"716000060381","PLUMON MARCADOR DE TINTA AL AGUA PUNTA GRUESA","UNIDAD",1.3]
["0383","PLUMON MARCADOR DE TINTA AL AGUA PUNTA MEDIANA",112,"A","71","60","0006","A",112,2016,1505,"B",1.0900000000000001,112,"17/06/2015 20:52:28.193","A","02050907","A_SIGA","2","18/06/2015 20:51:35.89","02050907",null,"0",0,0,0,0,"N",0,"UNIDAD",112,null,"UNIDAD",0,null,"716000060383",null,"716000060383","PLUMON MARCADOR DE TINTA AL AGUA PUNTA MEDIANA","UNIDAD",1.0900000000000001]
["0385","PLUMON RESALTADOR PUNTA MEDIANA BISELADA",112,"A","71","60","0006","A",112,2016,1505,"B",2.9,112,"23/06/2015 02:34:42.186","A","02050907","A_SIGA","2","23/06/2015 02:34:42.186","02050907",null,"0",0,0,0,0,"N",0,"UNIDAD",112,null,"UNIDAD",0,null,"716000060385",null,"716000060385","PLUMON RESALTADOR PUNTA MEDIANA BISELADA","UNIDAD",2.9]
["0389","PLUMON RESALTADOR PUNTA GRUESA BISELADA",112,"A","71","60","0006","A",112,2016,1505,"B",2.5,112,"04/06/2015 21:59:24.516","A","02050907","A_SIGA","2","08/06/2015 02:32:33.403","02050907",null,"0",0,0,0,0,"N",0,"UNIDAD",112,null,"UNIDAD",0,null,"716000060389",null,"716000060389","PLUMON RESALTADOR PUNTA GRUESA BISELADA","UNIDAD",2.5]
["0413","PLUMON MARCADOR DE TINTA AL AGUA PUNTA GRUESA COLOR NEGRO",112,"A","71","60","0006","A",112,2016,1505,"B",2.5,112,"04/06/2015 21:59:24.516","A","02050907","A_SIGA","2","08/06/2015 02:32:33.403","02050907",null,"0",0,0,0,0,"N",0,"UNIDAD",112,null,"UNIDAD",0,null,"716000060413",null,"716000060413","PLUMON MARCADOR DE TINTA AL AGUA PUNTA GRUESA COLOR NEGRO","UNIDAD",2.5]
["0414","PLUMON MARCADOR DE TINTA AL AGUA PUNTA GRUESA COLOR ROJO",112,"A","71","60","0006","A",112,2016,1505,"B",2.5,112,"04/06/2015 21:59:24.516","A","02050907","A_SIGA","2","08/06/2015 02:32:33.403","02050907",null,"0",0,0,0,0,"N",0,"UNIDAD",112,null,"UNIDAD",0,null,"716000060414",null,"716000060414","PLUMON MARCADOR DE TINTA AL AGUA PUNTA GRUESA COLOR ROJO","UNIDAD",2.5]
["0415","PLUMON MARCADOR DE TINTA AL AGUA PUNTA GRUESA COLOR AZUL",112,"A","71","60","0006","A",112,2016,1505,"B",2.5,112,"04/06/2015 21:59:24.516","A","02050907","A_SIGA","2","08/06/2015 02:32:33.403","02050907",null,"0",0,0,0,0,"N",0,"UNIDAD",112,null,"UNIDAD",0,null,"716000060415",null,"716000060415","PLUMON MARCADOR DE TINTA AL AGUA PUNTA GRUESA COLOR AZUL","UNIDAD",2.5]
["0416","PLUMON MARCADOR DE TINTA AL AGUA PUNTA GRUESA COLOR VERDE",112,"A","71","60","0006","A",112,2016,1505,"B",2.5,112,"04/06/2015 21:59:24.516","A","02050907","A_SIGA","2","08/06/2015 02:32:33.403","02050907",null,"0",0,0,0,0,"N",0,"UNIDAD",112,null,"UNIDAD",0,null,"716000060416",null,"716000060416","PLUMON MARCADOR DE TINTA AL AGUA PUNTA GRUESA COLOR VERDE","UNIDAD",2.5]
["0418","PLUMON MARCADOR DE TINTA AL AGUA PUNTA MEDIANA COLOR ROJO",112,"A","71","60","0006","A",112,2016,1004,"B",1.0855999999999999,112,"23/06/2015 10:34:13.983","A","04744514","A_SIGA","2","23/06/2015 10:34:13.983","04744514",null,"0",0,0,0,0,"N",0,"UNIDAD",112,null,"UNIDAD",0,null,"716000060418",null,"716000060418","PLUMON MARCADOR DE TINTA AL AGUA PUNTA MEDIANA COLOR ROJO","UNIDAD",1.0855999999999999]
["0419","PLUMON MARCADOR DE TINTA AL AGUA PUNTA MEDIANA COLOR AZUL",112,"A","71","60","0006","A",112,2016,1004,"B",1.0855999999999999,112,"23/06/2015 10:34:13.983","A","04744514","A_SIGA","2","23/06/2015 10:34:13.983","04744514",null,"0",0,0,0,0,"N",0,"UNIDAD",112,null,"UNIDAD",0,null,"716000060419",null,"716000060419","PLUMON MARCADOR DE TINTA AL AGUA PUNTA MEDIANA COLOR AZUL","UNIDAD",1.0855999999999999]
["0443","PLUMON RESALTADOR PUNTA GRUESA BISELADA COLOR AMARILLO",112,"A","71","60","0006","A",112,2016,1505,"B",2.5,112,"04/06/2015 21:59:24.516","A","02050907","A_SIGA","2","08/06/2015 02:32:33.403","02050907",null,"0",0,0,0,0,"N",0,"UNIDAD",112,null,"UNIDAD",0,null,"716000060443",null,"716000060443","PLUMON RESALTADOR PUNTA GRUESA BISELADA COLOR AMARILLO","UNIDAD",2.5]
["0444","PLUMON RESALTADOR PUNTA GRUESA BISELADA COLOR ANARANJADO",112,"A","71","60","0006","A",112,2016,1505,"B",2.5,112,"04/06/2015 21:59:24.516","A","02050907","A_SIGA","2","08/06/2015 02:32:33.403","02050907",null,"0",0,0,0,0,"N",0,"UNIDAD",112,null,"UNIDAD",0,null,"716000060444",null,"716000060444","PLUMON RESALTADOR PUNTA GRUESA BISELADA COLOR ANARANJADO","UNIDAD",2.5]
["0464","PLUMON MARCADOR DE TINTA AL AGUA PUNTA DELGADA JUEGO X 12 COLORES",112,"A","71","60","0006","A",112,2016,1004,"B",3,112,"23/06/2015 10:34:13.983","A","04744514","A_SIGA","2","23/06/2015 10:34:13.983","04744514",null,"0",0,0,0,0,"N",0,"UNIDAD",112,null,"UNIDAD",0,null,"716000060464",null,"716000060464","PLUMON MARCADOR DE TINTA AL AGUA PUNTA DELGADA JUEGO X 12 COLORES","UNIDAD",3]
["0540","PLUMON PARA PIZARRA ACRILICA PUNTA GRUESA RECARGABLE COLOR AZUL",112,"A","71","60","0006","A",112,2016,1505,"B",3.5,112,"04/06/2015 21:59:24.516","A","02050907","A_SIGA","2","08/06/2015 02:32:33.403","02050907",null,"0",0,0,0,0,"N",0,"UNIDAD",112,null,"UNIDAD",0,null,"716000060540",null,"716000060540","PLUMON PARA PIZARRA ACRILICA PUNTA GRUESA RECARGABLE COLOR AZUL","UNIDAD",3.5]
["0541","PLUMON PARA PIZARRA ACRILICA PUNTA GRUESA RECARGABLE COLOR ROJO",112,"A","71","60","0006","A",112,2016,1505,"B",3.5,112,"04/06/2015 21:59:24.516","A","02050907","A_SIGA","2","08/06/2015 02:32:33.403","02050907",null,"0",0,0,0,0,"N",0,"UNIDAD",112,null,"UNIDAD",0,null,"716000060541",null,"716000060541","PLUMON PARA PIZARRA ACRILICA PUNTA GRUESA RECARGABLE COLOR ROJO","UNIDAD",3.5]
["0542","PLUMON PARA PIZARRA ACRILICA PUNTA GRUESA RECARGABLE COLOR NEGRO",112,"A","71","60","0006","A",112,2016,1505,"B",3.5,112,"04/06/2015 21:59:24.516","A","02050907","A_SIGA","2","08/06/2015 02:32:33.403","02050907",null,"0",0,0,0,0,"N",0,"UNIDAD",112,null,"UNIDAD",0,null,"716000060542",null,"716000060542","PLUMON PARA PIZARRA ACRILICA PUNTA GRUESA RECARGABLE COLOR NEGRO","UNIDAD",3.5]
["0543","PLUMON PARA PIZARRA ACRILICA PUNTA GRUESA RECARGABLE COLOR VERDE",112,"A","71","60","0006","A",112,2016,1505,"B",3.5,112,"04/06/2015 21:59:24.516","A","02050907","A_SIGA","2","08/06/2015 02:32:33.403","02050907",null,"0",0,0,0,0,"N",0,"UNIDAD",112,null,"UNIDAD",0,null,"716000060543",null,"716000060543","PLUMON PARA PIZARRA ACRILICA PUNTA GRUESA RECARGABLE COLOR VERDE","UNIDAD",3.5]
["0546","PLUMON MARCADOR DE TINTA AL AGUA PUNTA  GRUESA",343,"A","71","60","0006","A",343,2016,1004,"B",0.7,343,"18/06/2015 10:00:33.72","A","04744514","A_SIGA","2","18/06/2015 10:00:33.72","04744514",null,"0",0,0,0,0,"N",0,"DOCENA",343,null,"DOCENA",0,null,"716000060546",null,"716000060546","PLUMON MARCADOR DE TINTA AL AGUA PUNTA  GRUESA","DOCENA",0.7]
["0578","PLUMÓN RESALTADOR PUNTA MEDIA BISELADA FORMA TRIANGULAR DE 3 COLORES",112,"A","71","60","0006","A",112,2016,1004,"B",1.54,112,"04/06/2015 15:07:32.983","A","01980772","ESCAL1","2","23/06/2015 10:34:13.983","04744514",null,"0",0,0,0,0,"N",0,"UNIDAD",112,null,"UNIDAD",0,null,"716000060578",null,"716000060578","PLUMÓN RESALTADOR PUNTA MEDIA BISELADA FORMA TRIANGULAR DE 3 COLORES","UNIDAD",1.54]
["0076","SELLO FECHADOR",112,"A","71","60","0008","A",112,2016,1004,"B",3,112,"23/06/2015 10:34:13.983","A","04744514","A_SIGA","2","23/06/2015 10:34:13.983","04744514",null,"0",0,0,0,0,"N",0,"UNIDAD",112,null,"UNIDAD",0,null,"716000080076",null,"716000080076","SELLO FECHADOR","UNIDAD",3]
["0203","SELLO FECHADOR AUTOENTINTABLE LETRA DE 4 mm",112,"A","71","60","0008","A",112,2016,1004,"B",6,112,"23/06/2015 10:34:13.983","A","04744514","A_SIGA","2","23/06/2015 10:34:13.983","04744514",null,"0",0,0,0,0,"N",0,"UNIDAD",112,null,"UNIDAD",0,null,"716000080203",null,"716000080203","SELLO FECHADOR AUTOENTINTABLE LETRA DE 4 mm","UNIDAD",6]
["0390","SELLO AUTOENTINTABLE 25 mm X 55 mm APROX.",112,"A","71","60","0008","A",112,2016,1004,"B",25.626999999999999,112,"23/06/2015 10:34:13.983","A","04744514","A_SIGA","2","23/06/2015 10:34:13.983","04744514",null,"0",0,0,0,0,"N",0,"UNIDAD",112,null,"UNIDAD",0,null,"716000080390",null,"716000080390","SELLO AUTOENTINTABLE 25 mm X 55 mm APROX.","UNIDAD",25.626999999999999]
["0043","TAMPON CON CUBIERTA DE PLASTICO TAMAÑO MEDIANO",112,"A","71","60","0009","A",112,2016,1505,"B",5,112,"04/06/2015 21:59:24.516","A","02050907","A_SIGA","2","08/06/2015 02:32:33.403","02050907",null,"0",0,0,0,0,"N",0,"UNIDAD",112,null,"UNIDAD",0,null,"716000090043",null,{"$f":"+AJ259","v":"716000090043"},{"$f":"+B259","v":"TAMPON CON CUBIERTA DE PLASTICO TAMAÑO MEDIANO"},{"$f":"+AG259","v":"UNIDAD"},{"$f":"+M259","v":5}]
["0044","TAMPON CON CUBIERTA DE PLASTICO TAMAÑO GRANDE",112,"A","71","60","0009","A",112,2016,1004,"B",9,112,"04/06/2015 15:07:32.983","A","01980772","ESCAL1","2","08/06/2015 14:53:26.64","01980772",null,"0",0,0,0,0,"N",0,"UNIDAD",112,null,"UNIDAD",0,null,"716000090044",null,"716000090044","TAMPON CON CUBIERTA DE PLASTICO TAMAÑO GRANDE","UNIDAD",9]
["0063","TAMPON CON CUBIERTA DE PLASTICO 11 cm X 7 cm APROX. COLOR AZUL",112,"A","71","60","0009","A",112,2016,1004,"B",2.95,112,"04/06/2015 15:07:32.983","A","01980772","ESCAL1","2","08/06/2015 14:53:26.64","01980772",null,"0",0,0,0,0,"N",0,"UNIDAD",112,null,"UNIDAD",0,null,"716000090063",null,"716000090063","TAMPON CON CUBIERTA DE PLASTICO 11 cm X 7 cm APROX. COLOR AZUL","UNIDAD",2.95]
["0064","TAMPON CON CUBIERTA DE PLASTICO 12.5 cm X 9.5 cm APROX. COLOR AZUL",112,"A","71","60","0009","A",112,2016,1004,"B",1.8,112,"18/06/2015 10:00:33.72","A","04744514","A_SIGA","2","18/06/2015 10:00:33.72","04744514",null,"0",0,0,0,0,"N",0,"UNIDAD",112,null,"UNIDAD",0,null,"716000090064",null,"716000090064","TAMPON CON CUBIERTA DE PLASTICO 12.5 cm X 9.5 cm APROX. COLOR AZUL","UNIDAD",1.8]
["0011","TINTA PARA TAMPON X 28 mL APROX.",112,"A","71","60","0016","A",112,2016,1505,"B",1.25,112,"17/06/2015 20:52:28.193","A","02050907","A_SIGA","2","18/06/2015 20:51:35.89","02050907",null,"0",0,0,0,0,"N",0,"UNIDAD",112,null,"UNIDAD",0,null,"716000160011",null,"716000160011","TINTA PARA TAMPON X 28 mL APROX.","UNIDAD",1.25]
["0020","TINTA PARA TAMPON X 28 mL APROX. COLOR ROJO",112,"A","71","60","0016","A",112,2016,1505,"B",1.25,112,"17/06/2015 20:52:28.193","A","02050907","A_SIGA","2","18/06/2015 20:51:35.89","02050907",null,"0",0,0,0,0,"N",0,"UNIDAD",112,null,"UNIDAD",0,null,"716000160020",null,"716000160020","TINTA PARA TAMPON X 28 mL APROX. COLOR ROJO","UNIDAD",1.25]
["0021","TINTA PARA TAMPON X 28 mL APROX. COLOR AZUL",112,"A","71","60","0016","A",112,2016,1505,"B",1.25,112,"17/06/2015 20:52:28.193","A","02050907","A_SIGA","2","18/06/2015 20:51:35.89","02050907",null,"0",0,0,0,0,"N",0,"UNIDAD",112,null,"UNIDAD",0,null,"716000160021",null,"716000160021","TINTA PARA TAMPON X 28 mL APROX. COLOR AZUL","UNIDAD",1.25]
["0022","TINTA PARA TAMPON X 28 mL APROX. COLOR NEGRO",112,"A","71","60","0016","A",112,2016,1505,"B",1.25,112,"17/06/2015 20:52:28.193","A","02050907","A_SIGA","2","18/06/2015 20:51:35.89","02050907",null,"0",0,0,0,0,"N",0,"UNIDAD",112,null,"UNIDAD",0,null,"716000160022",null,"716000160022","TINTA PARA TAMPON X 28 mL APROX. COLOR NEGRO","UNIDAD",1.25]
["0027","TINTA PARA TAMPON X 20 mL APROX. COLOR AZUL",112,"A","71","60","0016","A",112,2016,1505,"B",9,112,"17/06/2015 20:52:28.193","A","02050907","A_SIGA","2","18/06/2015 20:51:35.89","02050907",null,"0",0,0,0,0,"N",0,"UNIDAD",112,null,"UNIDAD",0,null,"716000160027",null,"716000160027","TINTA PARA TAMPON X 20 mL APROX. COLOR AZUL","UNIDAD",9]
["0028","TINTA PARA TAMPON X 20 mL APROX. COLOR NEGRO",112,"A","71","60","0016","A",112,2016,1505,"B",9,112,"17/06/2015 20:52:28.193","A","02050907","A_SIGA","2","18/06/2015 20:51:35.89","02050907",null,"0",0,0,0,0,"N",0,"UNIDAD",112,null,"UNIDAD",0,null,"716000160028",null,"716000160028","TINTA PARA TAMPON X 20 mL APROX. COLOR NEGRO","UNIDAD",9]
["0029","TINTA PARA TAMPON X 20 mL APROX. COLOR ROJO",112,"A","71","60","0016","A",112,2016,1505,"B",9,112,"17/06/2015 20:52:28.193","A","02050907","A_SIGA","2","18/06/2015 20:51:35.89","02050907",null,"0",0,0,0,0,"N",0,"UNIDAD",112,null,"UNIDAD",0,null,"716000160029",null,"716000160029","TINTA PARA TAMPON X 20 mL APROX. COLOR ROJO","UNIDAD",9]
["0002","LAPIZ DE CERA CRAYON DELGADO JUEGO X 12",112,"A","71","60","0019","A",112,2016,1004,"B",5.133,112,"03/06/2015 10:58:38.11","A","04744514","A_SIGA","2","08/06/2015 14:53:26.64","01980772",null,"0",0,0,0,0,"N",0,"UNIDAD",112,null,"UNIDAD",0,null,"716000190002",null,"716000190002","LAPIZ DE CERA CRAYON DELGADO JUEGO X 12","UNIDAD",5.133]
["0005","LAPIZ DE CERA CRAYON GRUESO JUEGO X 10",112,"A","71","60","0019","A",112,2016,1004,"B",4.17,112,"03/06/2015 10:58:38.11","A","04744514","A_SIGA","2","08/06/2015 14:53:26.64","01980772",null,"0",0,0,0,0,"N",0,"UNIDAD",112,null,"UNIDAD",0,null,"716000190005",null,"716000190005","LAPIZ DE CERA CRAYON GRUESO JUEGO X 10","UNIDAD",4.17]
["0003","TINTA PARA PLUMON DE PIZARRA ACRILICA X 30 mL",112,"A","71","60","0026","A",112,2016,1505,"B",13.9,112,"17/06/2015 20:52:28.193","A","02050907","A_SIGA","2","18/06/2015 20:51:35.89","02050907",null,"0",0,0,0,0,"N",0,"UNIDAD",112,null,"UNIDAD",0,null,"716000260003",null,"716000260003","TINTA PARA PLUMON DE PIZARRA ACRILICA X 30 mL","UNIDAD",13.9]
["0005","TINTA PARA PLUMON DE PIZARRA ACRILICA X 30 mL COLOR AZUL",112,"A","71","60","0026","A",112,2016,1505,"B",13.9,112,"04/06/2015 21:59:24.516","A","02050907","A_SIGA","2","08/06/2015 02:32:33.403","02050907",null,"0",0,0,0,0,"N",0,"UNIDAD",112,null,"UNIDAD",0,null,"716000260005",null,"716000260005","TINTA PARA PLUMON DE PIZARRA ACRILICA X 30 mL COLOR AZUL","UNIDAD",13.9]
["0006","TINTA PARA PLUMON DE PIZARRA ACRILICA X 30 mL COLOR VERDE",112,"A","71","60","0026","A",112,2016,1505,"B",13.9,112,"04/06/2015 21:59:24.516","A","02050907","A_SIGA","2","08/06/2015 02:32:33.403","02050907",null,"0",0,0,0,0,"N",0,"UNIDAD",112,null,"UNIDAD",0,null,"716000260006",null,"716000260006","TINTA PARA PLUMON DE PIZARRA ACRILICA X 30 mL COLOR VERDE","UNIDAD",13.9]
["0007","TINTA PARA PLUMON DE PIZARRA ACRILICA X 30 mL COLOR NEGRO",112,"A","71","60","0026","A",112,2016,1505,"B",13.9,112,"04/06/2015 21:59:24.516","A","02050907","A_SIGA","2","08/06/2015 02:32:33.403","02050907",null,"0",0,0,0,0,"N",0,"UNIDAD",112,null,"UNIDAD",0,null,"716000260007",null,"716000260007","TINTA PARA PLUMON DE PIZARRA ACRILICA X 30 mL COLOR NEGRO","UNIDAD",13.9]
["0008","TINTA PARA PLUMON DE PIZARRA ACRILICA X 30 mL COLOR ROJO",112,"A","71","60","0026","A",112,2016,1505,"B",13.9,112,"04/06/2015 21:59:24.516","A","02050907","A_SIGA","2","08/06/2015 02:32:33.403","02050907",null,"0",0,0,0,0,"N",0,"UNIDAD",112,null,"UNIDAD",0,null,{"$f":"CONCATENATE(E276,F276,G276,A276)","v":"716000260008"},null,"716000260008","TINTA PARA PLUMON DE PIZARRA ACRILICA X 30 mL COLOR ROJO","UNIDAD",13.9]
["0012","TINTA PARA PLUMON DE PIZARRA ACRILICA X 27.5 mL",112,"A","71","60","0026","A",112,2016,1505,"B",8,112,"17/06/2015 20:52:28.193","A","02050907","A_SIGA","2","18/06/2015 20:51:35.89","02050907",null,"0",0,0,0,0,"N",0,"UNIDAD",112,null,"UNIDAD",0,null,"716000260012",null,"716000260012","TINTA PARA PLUMON DE PIZARRA ACRILICA X 27.5 mL","UNIDAD",8]
["0013","TINTA PARA PLUMON DE PIZARRA ACRILICA X 27.5 mL COLOR AZUL",112,"A","71","60","0026","A",112,2016,1505,"B",8,112,"17/06/2015 20:52:28.193","A","02050907","A_SIGA","2","18/06/2015 20:51:35.89","02050907",null,"0",0,0,0,0,"N",0,"UNIDAD",112,null,"UNIDAD",0,null,"716000260013",null,"716000260013","TINTA PARA PLUMON DE PIZARRA ACRILICA X 27.5 mL COLOR AZUL","UNIDAD",8]
["0014","TINTA PARA PLUMON DE PIZARRA ACRILICA X 27.5 mL COLOR ROJO",112,"A","71","60","0026","A",112,2016,1505,"B",8,112,"17/06/2015 20:52:28.193","A","02050907","A_SIGA","2","18/06/2015 20:51:35.89","02050907",null,"0",0,0,0,0,"N",0,"UNIDAD",112,null,"UNIDAD",0,null,"716000260014",null,"716000260014","TINTA PARA PLUMON DE PIZARRA ACRILICA X 27.5 mL COLOR ROJO","UNIDAD",8]
["0015","TINTA PARA PLUMON DE PIZARRA ACRILICA X 27.5 mL COLOR NEGRO",112,"A","71","60","0026","A",112,2016,1505,"B",8,112,"17/06/2015 20:52:28.193","A","02050907","A_SIGA","2","18/06/2015 20:51:35.89","02050907",null,"0",0,0,0,0,"N",0,"UNIDAD",112,null,"UNIDAD",0,null,"716000260015",null,"716000260015","TINTA PARA PLUMON DE PIZARRA ACRILICA X 27.5 mL COLOR NEGRO","UNIDAD",8]
["0016","TINTA PARA PLUMON DE PIZARRA ACRILICA X 27.5 mL COLOR VERDE",112,"A","71","60","0026","A",112,2016,1505,"B",8,112,"17/06/2015 20:52:28.193","A","02050907","A_SIGA","2","18/06/2015 20:51:35.89","02050907",null,"0",0,0,0,0,"N",0,"UNIDAD",112,null,"UNIDAD",0,null,"716000260016",null,"716000260016","TINTA PARA PLUMON DE PIZARRA ACRILICA X 27.5 mL COLOR VERDE","UNIDAD",8]
["0004","TIZA CONVENCIONAL PARA PIZARRA COLOR BLANCO",339,"A","71","60","0027","A",339,2016,1004,"B",3.2,339,"04/06/2015 15:07:32.983","A","01980772","ESCAL1","2","08/06/2015 14:53:26.64","01980772",null,"0",0,0,0,0,"N",0,"CIENTO",339,null,"CIENTO",0,null,"716000270004",null,"716000270004","TIZA CONVENCIONAL PARA PIZARRA COLOR BLANCO","CIENTO",3.2]
["0152","BLOCK DE PAPEL BOND DE COLOR TAMAÑO A4 X 40 HOJAS",112,"A","71","72","0001","A",112,2016,1004,"B",70,112,"18/06/2015 10:00:33.72","A","04744514","A_SIGA","2","18/06/2015 10:00:33.72","04744514",null,"0",0,0,0,0,"N",0,"UNIDAD",112,null,"UNIDAD",0,null,"717200010152",null,"717200010152","BLOCK DE PAPEL BOND DE COLOR TAMAÑO A4 X 40 HOJAS","UNIDAD",70]
["0153","BLOCK DE CARTULINA PLASTIFICADA 32 cm X 47 cm X 20 HOJAS",112,"A","71","72","0001","A",112,2016,1004,"B",0.4,112,"18/06/2015 10:00:33.72","A","04744514","A_SIGA","2","18/06/2015 10:00:33.72","04744514",null,"0",0,0,0,0,"N",0,"UNIDAD",112,null,"UNIDAD",0,null,"717200010153",null,"717200010153","BLOCK DE CARTULINA PLASTIFICADA 32 cm X 47 cm X 20 HOJAS","UNIDAD",0.4]
["0168","BLOCK DE CARTULINA DE COLORES 23.5 cm X 31 cm X 20 HOJAS",112,"A","71","72","0001","A",112,2016,1004,"B",27,112,"18/06/2015 10:00:33.72","A","04744514","A_SIGA","2","18/06/2015 10:00:33.72","04744514",null,"0",0,0,0,0,"N",0,"UNIDAD",112,null,"UNIDAD",0,null,"717200010168",null,"717200010168","BLOCK DE CARTULINA DE COLORES 23.5 cm X 31 cm X 20 HOJAS","UNIDAD",27]
["0014","CUADERNO CUADRICULADO TAMAÑO A4 X 100 HOJAS",112,"A","71","72","0003","A",112,2016,1004,"B",4.43,112,"03/06/2015 10:58:38.11","A","04744514","A_SIGA","2","08/06/2015 14:53:26.64","01980772",null,"0",0,0,0,0,"N",0,"UNIDAD",112,null,"UNIDAD",null,null,"717200030014",null,"717200030014","CUADERNO CUADRICULADO TAMAÑO A4 X 100 HOJAS","UNIDAD",4.43]
["0020","CUADERNO ESPIRAL CUADRICULADO TAMAÑO A4 X 100 HOJAS",112,"A","71","72","0003","A",112,2016,1505,"B",7,112,"04/06/2015 21:59:24.516","A","02050907","A_SIGA","2","08/06/2015 02:32:33.403","02050907",null,"0",0,0,0,0,"N",0,"UNIDAD",112,null,"UNIDAD",null,null,"717200030020",null,"717200030020","CUADERNO ESPIRAL CUADRICULADO TAMAÑO A4 X 100 HOJAS","UNIDAD",7]
["0023","CUADERNO ESPIRAL CUADRICULADO TAMAÑO A4 X 200 HOJAS",112,"A","71","72","0003","A",112,2016,1505,"B",9,112,"04/06/2015 21:59:24.516","A","02050907","A_SIGA","2","08/06/2015 02:32:33.403","02050907",null,"0",0,0,0,0,"N",0,"UNIDAD",112,null,"UNIDAD",null,null,"717200030023",null,"717200030023","CUADERNO ESPIRAL CUADRICULADO TAMAÑO A4 X 200 HOJAS","UNIDAD",9]
["0024","CUADERNO ESPIRAL CUADRICULADO TAMAÑO A5 X 200 HOJAS",112,"A","71","72","0003","A",112,2016,1505,"B",4.5,112,"17/06/2015 20:52:28.193","A","02050907","A_SIGA","2","18/06/2015 20:51:35.89","02050907",null,"0",0,0,0,0,"N",0,"UNIDAD",112,null,"UNIDAD",null,null,"717200030024",null,"717200030024","CUADERNO ESPIRAL CUADRICULADO TAMAÑO A5 X 200 HOJAS","UNIDAD",4.5]
["0027","CUADERNO ESPIRAL RAYADO TAMAÑO A4 X 100 HOJAS",112,"A","71","72","0003","A",112,2016,1004,"B",4.2480000000000002,112,"03/06/2015 10:58:38.11","A","04744514","A_SIGA","2","08/06/2015 14:53:26.64","01980772",null,"0",0,0,0,0,"N",0,"UNIDAD",112,null,"UNIDAD",1.2,"01/07/2015 00:00:00","717200030027",null,"717200030027","CUADERNO ESPIRAL RAYADO TAMAÑO A4 X 100 HOJAS","UNIDAD",4.2480000000000002]
["0120","CUADERNO CUADRICULADO TAMAÑO A4 X 88 HOJAS",112,"A","71","72","0003","A",112,2016,1505,"B",5.5,112,"17/06/2015 20:52:28.193","A","02050907","A_SIGA","2","18/06/2015 20:51:35.89","02050907",null,"0",0,0,0,0,"N",0,"UNIDAD",112,null,"UNIDAD",0,null,"717200030120",null,"717200030120","CUADERNO CUADRICULADO TAMAÑO A4 X 88 HOJAS","UNIDAD",5.5]
["0159","CUADERNO EMPASTADO CUADRICULADO TAMAÑO A5 X 100 HOJAS",112,"A","71","72","0003","A",112,2016,1004,"B",2.5960000000000001,112,"03/06/2015 10:58:38.11","A","04744514","A_SIGA","2","08/06/2015 14:53:26.64","01980772",null,"0",0,0,0,0,"N",0,"UNIDAD",112,null,"UNIDAD",0,null,"717200030159",null,"717200030159","CUADERNO EMPASTADO CUADRICULADO TAMAÑO A5 X 100 HOJAS","UNIDAD",2.5960000000000001]
["0226","CUADERNO DOBLE ESPIRAL CUADRICULADO TAMAÑO A4 X 100 HOJAS",112,"A","71","72","0003","A",112,2016,1004,"B",2.5960000000000001,112,"03/06/2015 10:58:38.11","A","04744514","A_SIGA","2","08/06/2015 14:53:26.64","01980772",null,"0",0,0,0,0,"N",0,"UNIDAD",112,null,"UNIDAD",0,null,"717200030226",null,"717200030226","CUADERNO DOBLE ESPIRAL CUADRICULADO TAMAÑO A4 X 100 HOJAS","UNIDAD",2.5960000000000001]
["0272","CUADERNO CUADRICULADO TAMAÑO A4 X 82 HOJAS",112,"A","71","72","0003","A",112,2016,1004,"B",2.5,112,"18/06/2015 10:00:33.72","A","04744514","A_SIGA","2","18/06/2015 10:00:33.72","04744514",null,"0",0,0,0,0,"N",0,"UNIDAD",112,null,"UNIDAD",0,null,"717200030272",null,"717200030272","CUADERNO CUADRICULADO TAMAÑO A4 X 82 HOJAS","UNIDAD",2.5]
["0287","CUADERNO DOBLE ESPIRAL CUADRICULADO TAMAÑO A4 X 180 HOJAS",112,"A","71","72","0003","A",112,2016,1004,"B",7.25,112,"03/06/2015 10:58:38.11","A","04744514","A_SIGA","2","08/06/2015 14:53:26.64","01980772",null,"0",0,0,0,0,"N",0,"UNIDAD",112,null,"UNIDAD",0,null,"717200030287",null,"717200030287","CUADERNO DOBLE ESPIRAL CUADRICULADO TAMAÑO A4 X 180 HOJAS","UNIDAD",7.25]
["0288","CUADERNO DOBLE ESPIRAL CUADRICULADO TAMAÑO A5 X 180 HOJAS",112,"A","71","72","0003","A",112,2016,1004,"B",6.5,112,"03/06/2015 10:58:38.11","A","04744514","A_SIGA","2","08/06/2015 14:53:26.64","01980772",null,"0",0,0,0,0,"N",0,"UNIDAD",112,null,"UNIDAD",0,null,"717200030288",null,"717200030288","CUADERNO DOBLE ESPIRAL CUADRICULADO TAMAÑO A5 X 180 HOJAS","UNIDAD",6.5]
["0212","PAPEL BOND  75 g TAMAÑO A4",350,"A","71","72","0005","A",350,2016,1505,"B",12.98,350,"04/06/2015 21:59:24.516","A","02050907","A_SIGA","2","08/06/2015 02:32:33.403","02050907",null,"0",0,0,0,0,"N",0,"MILLAR",350,null,"MILLAR",0,null,"717200050212",null,"717200050212","PAPEL BOND  75 g TAMAÑO A4","MILLAR",12.98]
["0224","PAPEL BOND 80 g TAMAÑO  A4",452,"A","71","72","0005","A",452,2016,1004,"B",12,452,"18/06/2015 10:00:33.72","A","04744514","A_SIGA","2","23/06/2015 10:34:13.983","04744514",null,"0",0,0,0,0,"N",0,"EMPAQUE X 500",452,null,"EMPAQUE X 500",0,null,"717200050224",null,"717200050224","PAPEL BOND 80 g TAMAÑO  A4","EMPAQUE X 500",12]
["0227","PAPEL BOND 75 g  TAMAÑO A4",452,"A","71","72","0005","A",452,2016,1004,"B",15.16,452,"03/06/2015 15:28:35.876","A","01980772","ESCAL1","2","08/06/2015 14:53:26.64","01980772",null,"0",0,0,0,0,"N",0,"EMPAQUE X 500",452,null,"EMPAQUE X 500",0,null,"717200050227",null,"717200050227","PAPEL BOND 75 g  TAMAÑO A4","EMPAQUE X 500",15.16]
["0230","PAPEL BOND DE 75 g TAMAÑO A4 DE COLOR",452,"A","71","72","0005","A",452,2016,1004,"B",14.9,452,"03/06/2015 15:28:35.876","A","01980772","ESCAL1","2","08/06/2015 14:53:26.64","01980772",null,"0",0,0,0,0,"N",0,"EMPAQUE X 500",452,null,"EMPAQUE X 500",0,null,"717200050230",null,"717200050230","PAPEL BOND DE 75 g TAMAÑO A4 DE COLOR","EMPAQUE X 500",14.9]
["0237","PAPEL BOND 80 g  TAMAÑO OFICIO",350,"A","71","72","0005","A",350,2016,1505,"B",15,350,"17/06/2015 20:52:28.193","A","02050907","A_SIGA","2","18/06/2015 20:51:35.89","02050907",null,"0",0,0,0,0,"N",0,"MILLAR",350,null,"MILLAR",0,null,"717200050237",null,"717200050237","PAPEL BOND 80 g  TAMAÑO OFICIO","MILLAR",15]
["0242","PAPEL BOND 80 g TAMAÑO A4 DE COLORES",452,"A","71","72","0005","A",452,2016,1004,"B",27,452,"03/06/2015 11:34:37.646","A","01341895","PELA-PC","2","03/06/2015 11:34:37.646","01341895",null,"0",0,0,0,0,"N",0,"EMPAQUE X 500",452,null,"EMPAQUE X 500",0,null,"717200050242",null,"717200050242","PAPEL BOND 80 g TAMAÑO A4 DE COLORES","EMPAQUE X 500",27]
["0257","PAPEL BOND 75 g TAMAÑO A4 DE COLOR",350,"A","71","72","0005","A",350,2016,1505,"B",14.2,350,"17/06/2015 20:52:28.193","A","02050907","A_SIGA","2","18/06/2015 20:51:35.89","02050907",null,"0",0,0,0,0,"N",0,"MILLAR",350,null,"MILLAR",0,null,"717200050257",null,"717200050257","PAPEL BOND 75 g TAMAÑO A4 DE COLOR","MILLAR",14.2]
["0338","PAPEL BOND 56 g  DE 61 cm X 86 cm",452,"A","71","72","0005","A",452,2016,1004,"B",2.3954,452,"18/06/2015 10:00:33.72","A","04744514","A_SIGA","2","18/06/2015 10:00:33.72","04744514",null,"0",0,0,0,0,"N",0,"EMPAQUE X 500",452,null,"EMPAQUE X 500",0,null,"717200050338",null,"717200050338","PAPEL BOND 56 g  DE 61 cm X 86 cm","EMPAQUE X 500",2.3954]
["0349","PAPEL BOND 90 g DE 61 cm X  86 cm",452,"A","71","72","0005","A",452,2016,1004,"B",70,452,"03/06/2015 15:28:35.876","A","01980772","ESCAL1","2","23/06/2015 10:34:13.983","04744514",null,"0",0,0,0,0,"N",0,"EMPAQUE X 500",452,null,"EMPAQUE X 500",0,null,"717200050349",null,"717200050349","PAPEL BOND 90 g DE 61 cm X  86 cm","EMPAQUE X 500",70]
["0034","PAPEL KRAFT 50 g DE 1.20 m X 75  cm",452,"A","71","72","0008","A",452,2016,1004,"B",12,452,"18/06/2015 10:00:33.72","A","04744514","A_SIGA","2","18/06/2015 10:00:33.72","04744514",null,"0",0,0,0,0,"N",0,"EMPAQUE X 500",452,null,"EMPAQUE X 500",0,null,"717200080034",null,"717200080034","PAPEL KRAFT 50 g DE 1.20 m X 75  cm","EMPAQUE X 500",12]
["0035","PAPEL KRAFT 75 g DE 1.20 m X 75 cm",452,"A","71","72","0008","A",452,2016,1505,"B",0.24,452,"17/06/2015 20:52:28.193","A","02050907","A_SIGA","2","18/06/2015 20:51:35.89","02050907",null,"0",0,0,0,0,"N",0,"EMPAQUE X 500",452,null,"EMPAQUE X 500",0,null,"717200080035",null,"717200080035","PAPEL KRAFT 75 g DE 1.20 m X 75 cm","EMPAQUE X 500",0.24]
["0003","LIBRO DE ACTAS DE 200 FOLIOS",112,"A","71","72","0014","A",112,2016,1004,"B",8.5,112,"03/06/2015 15:28:35.876","A","01980772","ESCAL1","2","08/06/2015 14:53:26.64","01980772",null,"0",0,0,0,0,"N",0,"UNIDAD",112,null,"UNIDAD",null,null,"717200140003",null,"717200140003","LIBRO DE ACTAS DE 200 FOLIOS","UNIDAD",8.5]
["0059","LIBRO DE ACTAS RAYADO 75 GR X (100 HOJAS )A-4 200 FOLIOS",112,"A","71","72","0014","A",112,2016,1004,"B",1.0029999999999999,112,"18/06/2015 10:00:33.72","A","04744514","A_SIGA","2","18/06/2015 10:00:33.72","04744514",null,"0",0,0,0,0,"N",0,"UNIDAD",112,null,"UNIDAD",0,null,"717200140059",null,"717200140059","LIBRO DE ACTAS RAYADO 75 GR X (100 HOJAS )A-4 200 FOLIOS","UNIDAD",1.0029999999999999]
["0085","LIBRO DE INVENTARIO X 200 FOLIOS",112,"A","71","72","0014","A",112,2016,1004,"B",8.5,112,"03/06/2015 15:28:35.876","A","01980772","ESCAL1","2","08/06/2015 14:53:26.64","01980772",null,"0",0,0,0,0,"N",0,"UNIDAD",112,null,"UNIDAD",0,null,"717200140085",null,"717200140085","LIBRO DE INVENTARIO X 200 FOLIOS","UNIDAD",8.5]
["0150","LIBRO DE ACTAS EMPASTADO RAYADO TAMAÑO A4 X 200 HOJAS",112,"A","71","72","0014","A",112,2016,1505,"B",15,112,"04/06/2015 21:59:24.516","A","02050907","A_SIGA","2","08/06/2015 02:32:33.403","02050907",null,"0",0,0,0,0,"N",0,"UNIDAD",112,null,"UNIDAD",0,null,"717200140150",null,"717200140150","LIBRO DE ACTAS EMPASTADO RAYADO TAMAÑO A4 X 200 HOJAS","UNIDAD",15]
["0152","LIBRO DE ACTAS EMPASTADO RAYADO TAMAÑO A4 X 100 HOJAS",112,"A","71","72","0014","A",112,2016,1505,"B",9.9,112,"04/06/2015 21:59:24.516","A","02050907","A_SIGA","2","08/06/2015 02:32:33.403","02050907",null,"0",0,0,0,0,"N",0,"UNIDAD",112,null,"UNIDAD",0,null,"717200140152",null,"717200140152","LIBRO DE ACTAS EMPASTADO RAYADO TAMAÑO A4 X 100 HOJAS","UNIDAD",9.9]
["0196","LIBRO DE ACTAS EMPASTADO RAYADO TAMAÑO A4 X 50 HOJAS",112,"A","71","72","0014","A",112,2016,1505,"B",9.9,112,"04/06/2015 21:59:24.516","A","02050907","A_SIGA","2","18/06/2015 20:51:35.89","02050907",null,"0",0,0,0,0,"N",0,"UNIDAD",112,null,"UNIDAD",0,null,"717200140196",null,"717200140196","LIBRO DE ACTAS EMPASTADO RAYADO TAMAÑO A4 X 50 HOJAS","UNIDAD",9.9]
["0015","PAPEL CUADRICULADO 8 OFICIOS",112,"A","71","72","0015","A",112,2016,1505,"B",0.23,112,"17/06/2015 20:52:28.193","A","02050907","A_SIGA","2","18/06/2015 20:51:35.89","02050907",null,"0",0,0,0,0,"N",0,"UNIDAD",112,null,"UNIDAD",0,null,"717200150015",null,"717200150015","PAPEL CUADRICULADO 8 OFICIOS","UNIDAD",0.23]
["0024","PAPEL LUSTRE DE 50 cm X 65 cm",112,"A","71","72","0017","A",112,2016,1004,"B",15,112,"18/06/2015 10:00:33.72","A","04744514","A_SIGA","2","18/06/2015 10:00:33.72","04744514",null,"0",0,0,0,0,"N",0,"UNIDAD",112,null,"UNIDAD",0,null,"717200170024",null,"717200170024","PAPEL LUSTRE DE 50 cm X 65 cm","UNIDAD",15]
["0085","PAPEL LUSTRE DE 50 cm X 65 cm.",343,"A","71","72","0017","A",343,2016,1004,"B",0.16520000000000001,343,"03/06/2015 15:28:35.876","A","01980772","ESCAL1","2","08/06/2015 14:53:26.64","01980772",null,"0",0,0,0,0,"N",0,"DOCENA",343,null,"DOCENA",0,null,"717200170085",null,"717200170085","PAPEL LUSTRE DE 50 cm X 65 cm.","DOCENA",0.16520000000000001]
["0017","PAPEL CREPE DE 1.80 m X 50 cm",112,"A","71","72","0018","A",112,2016,1004,"B",3.5,112,"03/06/2015 15:28:35.876","A","01980772","ESCAL1","2","08/06/2015 14:53:26.64","01980772",null,"0",0,0,0,0,"N",0,"UNIDAD",112,null,"UNIDAD",0,null,"717200180017",null,"717200180017","PAPEL CREPE DE 1.80 m X 50 cm","UNIDAD",3.5]
["0028","PAPEL CREPE DE 1.80 m X 50 cm COLORES VARIADOS",445,"A","71","72","0018","A",445,2016,1004,"B",3.5,445,"18/06/2015 10:00:33.72","A","04744514","A_SIGA","2","18/06/2015 10:00:33.72","04744514",null,"0",0,0,0,0,"N",0,"DECENA",445,null,"DECENA",0,null,"717200180028",null,"717200180028","PAPEL CREPE DE 1.80 m X 50 cm COLORES VARIADOS","DECENA",3.5]
["0013","PAPELOGRAFO RAYADO 60 g DE 61 cm X 86 cm",112,"A","71","72","0026","A",112,2016,1505,"B",0.25,112,"17/06/2015 20:52:28.193","A","02050907","A_SIGA","2","18/06/2015 20:51:35.89","02050907",null,"0",0,0,0,0,"N",0,"UNIDAD",112,null,"UNIDAD",0,null,"717200260013",null,"717200260013","PAPELOGRAFO RAYADO 60 g DE 61 cm X 86 cm","UNIDAD",0.25]
["0028","PAPEL SEDITA DIFERENTES COLORES",112,"A","71","72","0029","A",112,2016,1004,"B",0.16,112,"03/06/2015 15:28:35.876","A","01980772","ESCAL1","2","08/06/2015 14:53:26.64","01980772",null,"0",0,0,0,0,"N",0,"UNIDAD",112,null,"UNIDAD",0,null,"717200290028",null,"717200290028","PAPEL SEDITA DIFERENTES COLORES","UNIDAD",0.16]
["0118","PAPEL COMETA",112,"A","71","72","0029","A",112,2016,1004,"B",0.14000000000000001,112,"03/06/2015 15:28:35.876","A","01980772","ESCAL1","2","08/06/2015 14:53:26.64","01980772",null,"0",0,0,0,0,"N",0,"UNIDAD",112,null,"UNIDAD",0,null,"717200290118",null,"717200290118","PAPEL COMETA","UNIDAD",0.14000000000000001]
["0221","PAPEL SEDA 50 cm X  65 cm",112,"A","71","72","0029","A",112,2016,1505,"B",0.15,112,"17/06/2015 20:52:28.193","A","02050907","A_SIGA","2","18/06/2015 20:51:35.89","02050907",null,"0",0,0,0,0,"N",0,"UNIDAD",112,null,"UNIDAD",0,null,"717200290221",null,"717200290221","PAPEL SEDA 50 cm X  65 cm","UNIDAD",0.15]
["0022","PAPEL BULKY 52 g TAMAÑO  A4",350,"A","71","72","0033","A",350,2016,1505,"B",19,350,"17/06/2015 20:52:28.193","A","02050907","A_SIGA","2","18/06/2015 20:51:35.89","02050907",null,"0",0,0,0,0,"N",0,"MILLAR",350,null,"MILLAR",0,null,"717200330022",null,{"$f":"+AJ323","v":"717200330022"},{"$f":"+B323","v":"PAPEL BULKY 52 g TAMAÑO  A4"},{"$f":"+AG323","v":"MILLAR"},{"$f":"+M323","v":19}]
["0039","PAPEL BULKY 52 g  TAMAÑO A4",452,"A","71","72","0033","A",452,2016,1004,"B",9.32,452,"03/06/2015 15:28:35.876","A","01980772","ESCAL1","2","08/06/2015 14:53:26.64","01980772",null,"0",0,0,0,0,"N",0,"EMPAQUE X 500",452,null,"EMPAQUE X 500",0,null,"717200330039",null,"717200330039","PAPEL BULKY 52 g  TAMAÑO A4","EMPAQUE X 500",9.32]
["0005","CARTULINA DE HILO 165 g DE 50 cm X 65 cm",112,"A","71","73","0005","A",112,2016,1004,"B",0.59,112,"03/06/2015 10:58:38.11","A","04744514","A_SIGA","2","08/06/2015 14:53:26.64","01980772",null,"0",0,0,0,0,"N",0,"UNIDAD",112,null,"UNIDAD",0,null,"717300050005",null,"717300050005","CARTULINA DE HILO 165 g DE 50 cm X 65 cm","UNIDAD",0.59]
["0045","CARTULINA SIMPLE 180 g DE 100 cm X 50 cm",112,"A","71","73","0011","A",112,2016,1505,"B",0.39,112,"04/06/2015 21:59:24.516","A","02050907","A_SIGA","2","08/06/2015 02:32:33.403","02050907",null,"0",0,0,0,0,"N",0,"UNIDAD",112,null,"UNIDAD",0,null,"717300110045",null,"717300110045","CARTULINA SIMPLE 180 g DE 100 cm X 50 cm","UNIDAD",0.39]
["0097","CARTULINA SATINADA 150 g DE 50 cm X 65 cm COLOR BLANCO",112,"A","71","73","0011","A",112,2016,1004,"B",0.26,112,"03/06/2015 10:58:38.11","A","04744514","A_SIGA","2","08/06/2015 14:53:26.64","01980772",null,"0",0,0,0,0,"N",0,"UNIDAD",112,null,"UNIDAD",0,null,"717300110097",null,"717300110097","CARTULINA SATINADA 150 g DE 50 cm X 65 cm COLOR BLANCO","UNIDAD",0.26]
["0140","CARTULINA CORRUGADA 180 g DE 50 cm X 65 cm DE COLOR",112,"A","71","73","0011","A",112,2016,1004,"B",2.2999999999999998,112,"23/06/2015 10:34:13.983","A","04744514","A_SIGA","2","23/06/2015 10:34:13.983","04744514",null,"0",0,0,0,0,"N",0,"UNIDAD",112,null,"UNIDAD",0,null,"717300110140",null,"717300110140","CARTULINA CORRUGADA 180 g DE 50 cm X 65 cm DE COLOR","UNIDAD",2.2999999999999998]
["0192","CARTULINA SATINADA 150 g DE 50 cm X 65 cm DE COLOR",112,"A","71","73","0011","A",112,2016,1004,"B",0.25,112,"03/06/2015 10:58:38.11","A","04744514","A_SIGA","2","08/06/2015 14:53:26.64","01980772",null,"0",0,0,0,0,"N",0,"UNIDAD",112,null,"UNIDAD",0,null,"717300110192",null,"717300110192","CARTULINA SATINADA 150 g DE 50 cm X 65 cm DE COLOR","UNIDAD",0.25]
["0264","CARTULINA PLASTIFICADA 50 cm X 70 cm",112,"A","71","73","0011","A",112,2016,1004,"B",0.7,112,"23/06/2015 10:34:13.983","A","04744514","A_SIGA","2","23/06/2015 10:34:13.983","04744514",null,"0",0,0,0,0,"N",0,"UNIDAD",112,null,"UNIDAD",0,null,"717300110264",null,"717300110264","CARTULINA PLASTIFICADA 50 cm X 70 cm","UNIDAD",0.7]
["0015","CARTULINA TIPO CANSON 150 g DE 50 cm X 65 cm DE COLORES",112,"A","71","73","0012","A",112,2016,1004,"B",1.4,112,"23/06/2015 10:34:13.983","A","04744514","A_SIGA","2","23/06/2015 10:34:13.983","04744514",null,"0",0,0,0,0,"N",0,"UNIDAD",112,null,"UNIDAD",0,null,"717300120015",null,"717300120015","CARTULINA TIPO CANSON 150 g DE 50 cm X 65 cm DE COLORES","UNIDAD",1.4]
["0022","ALFILER DE METAL X 50 g",112,"A","71","85","0001","A",112,2016,1004,"B",12,112,"18/06/2015 10:00:33.72","A","04744514","A_SIGA","2","18/06/2015 10:00:33.72","04744514",null,"0",0,0,0,0,"N",0,"UNIDAD",112,null,"UNIDAD",0,null,"718500010022",null,"718500010022","ALFILER DE METAL X 50 g","UNIDAD",12]
["0001","CLIP DE METAL CHICO Nº 1 X 100",112,"A","71","85","0005","A",112,2016,1004,"B",2.3954,112,"18/06/2015 10:00:33.72","A","04744514","A_SIGA","2","18/06/2015 10:00:33.72","04744514",null,"0",0,0,0,0,"N",0,"UNIDAD",112,null,"UNIDAD",null,null,"718500050001",null,"718500050001","CLIP DE METAL CHICO Nº 1 X 100","UNIDAD",2.3954]
["0004","CLIP MARIPOSA DE METAL Nº 3 X 12",112,"A","71","85","0005","A",112,2016,1004,"B",2.29,112,"23/06/2015 10:34:13.983","A","04744514","A_SIGA","2","23/06/2015 10:34:13.983","04744514",null,"0",0,0,0,0,"N",0,"UNIDAD",112,null,"UNIDAD",null,null,"718500050004",null,"718500050004","CLIP MARIPOSA DE METAL Nº 3 X 12","UNIDAD",2.29]
["0005","CLIP MARIPOSA DE METAL Nº 2 X 50",112,"A","71","85","0005","A",112,2016,1004,"B",1.9588000000000001,112,"03/06/2015 10:58:38.11","A","04744514","A_SIGA","2","08/06/2015 14:53:26.64","01980772",null,"0",0,0,0,0,"N",0,"UNIDAD",112,null,"UNIDAD",null,null,"718500050005",null,"718500050005","CLIP MARIPOSA DE METAL Nº 2 X 50","UNIDAD",1.9588000000000001]
["0021","CLIP MARIPOSA DE METAL Nº 1 X 12",112,"A","71","85","0005","A",112,2016,1505,"B",1.25,112,"17/06/2015 20:52:28.193","A","02050907","A_SIGA","2","21/06/2015 21:57:51.323","02050907",null,"0",0,0,0,0,"N",0,"UNIDAD",112,null,"UNIDAD",0,null,"718500050021",null,"718500050021","CLIP MARIPOSA DE METAL Nº 1 X 12","UNIDAD",1.25]
["0025","CLIP MARIPOSA DE METAL Nº 1 X 50",112,"A","71","85","0005","A",112,2016,1004,"B",2.29,112,"03/06/2015 10:58:38.11","A","04744514","A_SIGA","2","08/06/2015 14:53:26.64","01980772",null,"0",0,0,0,0,"N",0,"UNIDAD",112,null,"UNIDAD",0,null,"718500050025",null,"718500050025","CLIP MARIPOSA DE METAL Nº 1 X 50","UNIDAD",2.29]
["0029","CLIP MARIPOSA DE METAL Nº 1 X 100",112,"A","71","85","0005","A",112,2016,1004,"B",2.29,112,"03/06/2015 10:58:38.11","A","04744514","A_SIGA","2","08/06/2015 14:53:26.64","01980772",null,"0",0,0,0,0,"N",0,"UNIDAD",112,null,"UNIDAD",0,null,"718500050029",null,"718500050029","CLIP MARIPOSA DE METAL Nº 1 X 100","UNIDAD",2.29]
["0001","CHINCHE CON CABEZA DE COLORES X 100",112,"A","71","85","0006","A",112,2016,1004,"B",1.357,112,"03/06/2015 10:58:38.11","A","04744514","A_SIGA","2","08/06/2015 14:53:26.64","01980772",null,"0",0,0,0,0,"N",0,"UNIDAD",112,null,"UNIDAD",null,null,"718500060001",null,"718500060001","CHINCHE CON CABEZA DE COLORES X 100","UNIDAD",1.357]
["0002","CHINCHE CON CABEZA DORADA X 100",112,"A","71","85","0006","A",112,2016,1004,"B",1,112,"03/06/2015 10:58:38.11","A","04744514","A_SIGA","2","08/06/2015 14:53:26.64","01980772",null,"0",0,0,0,0,"N",0,"UNIDAD",112,null,"UNIDAD",null,null,{"$f":"CONCATENATE(E340,F340,G340,A340)","v":"718500060002"},null,"718500060002","CHINCHE CON CABEZA DORADA X 100","UNIDAD",1]
["0021","GRAPA 23/8 X 1000",112,"A","71","85","0008","A",112,2016,1505,"B",1.98,112,"17/06/2015 20:52:28.193","A","02050907","A_SIGA","2","21/06/2015 21:57:51.323","02050907",null,"0",0,0,0,0,"N",0,"UNIDAD",112,null,"UNIDAD",null,null,"718500080021",null,"718500080021","GRAPA 23/8 X 1000","UNIDAD",1.98]
["0026","GRAPA 26/6 X 5000",112,"A","71","85","0008","A",112,2016,1505,"B",1.85,112,"21/06/2015 21:57:51.323","A","02050907","A_SIGA","2","21/06/2015 21:57:51.323","02050907",null,"0",0,0,0,0,"N",0,"UNIDAD",112,null,"UNIDAD",null,null,"718500080026",null,"718500080026","GRAPA 26/6 X 5000","UNIDAD",1.85]
["0010","SUJETADOR PARA PAPEL (TIPO FASTENER) DE METAL X 100",112,"A","71","85","0010","A",112,2016,1004,"B",4.4800000000000004,112,"04/06/2015 15:07:32.983","A","01980772","ESCAL1","2","08/06/2015 14:53:26.64","01980772",null,"0",0,0,0,0,"N",0,"UNIDAD",112,null,"UNIDAD",0,null,"718500100010",null,"718500100010","SUJETADOR PARA PAPEL (TIPO FASTENER) DE METAL X 100","UNIDAD",4.4800000000000004]
["0014","SUJETADOR PARA PAPEL (TIPO FASTENER) DE METAL X 50",112,"A","71","85","0010","A",112,2016,1004,"B",3.87,112,"23/06/2015 10:34:13.983","A","04744514","A_SIGA","2","23/06/2015 10:34:13.983","04744514",null,"0",0,0,0,0,"N",0,"UNIDAD",112,null,"UNIDAD",0,null,"718500100014",null,"718500100014","SUJETADOR PARA PAPEL (TIPO FASTENER) DE METAL X 50","UNIDAD",3.87]
["0017","SUJETADOR PARA PAPEL (TIPO FASTENER) DE METAL",449,"A","71","85","0010","A",449,2016,1505,"B",3.5,449,"17/06/2015 20:52:28.193","A","02050907","A_SIGA","2","18/06/2015 20:51:35.89","02050907",null,"0",0,0,0,0,"N",0,"EMPAQUE X 50",449,null,"EMPAQUE X 50",0,null,"718500100017",null,"718500100017","SUJETADOR PARA PAPEL (TIPO FASTENER) DE METAL","EMPAQUE X 50",3.5]
["0021","SUJETADOR PARA PAPEL (TIPO FASTENER) DE  METAL",112,"A","71","85","0010","A",112,2016,1505,"B",3.5,112,"04/06/2015 21:59:24.516","A","02050907","A_SIGA","2","08/06/2015 02:32:33.403","02050907",null,"0",0,0,0,0,"N",0,"UNIDAD",112,null,"UNIDAD",0,null,"718500100021",null,"718500100021","SUJETADOR PARA PAPEL (TIPO FASTENER) DE  METAL","UNIDAD",3.5]
["0045","LIGA DE JEBE DELGADA Nº  18",339,"A","71","85","0011","A",339,2016,1004,"B",2,339,"03/06/2015 15:28:35.876","A","01980772","ESCAL1","2","08/06/2015 14:53:26.64","01980772",null,"0",0,0,0,0,"N",0,"CIENTO",339,null,"CIENTO",0,null,"718500110045",null,"718500110045","LIGA DE JEBE DELGADA Nº  18","CIENTO",2]
["0008","BINDER CLIP (CLIP BILLETERO) DE 3/4 in X 12",112,"A","71","85","0014","A",112,2016,1004,"B",0.84,112,"23/06/2015 10:34:13.983","A","04744514","A_SIGA","2","23/06/2015 10:34:13.983","04744514",null,"0",0,0,0,0,"N",0,"UNIDAD",112,null,"UNIDAD",0,null,"718500140008",null,"718500140008","BINDER CLIP (CLIP BILLETERO) DE 3/4 in X 12","UNIDAD",0.84]
[null,null,null,null,null,null,null,null,null,null,null,null,null,null,null,null,null,null,null,null,null,null,null,null,null,null,null,null,null,null,null,null,null,null,null,null,null,0,0,0,0]
["0033","COLA SINTETICA X 250 g",112,"A","73","70","0001","A",112,2016,1505,"B",2,112,"17/06/2015 20:52:28.193","A","02050907","A_SIGA","2","18/06/2015 20:51:35.89","02050907",null,"0",0,0,0,0,"N",0,"UNIDAD",112,null,"UNIDAD",0,null,{"$f":"CONCATENATE(E350,F350,G350,A350)","v":"737000010033"},null,"737000010033","COLA SINTETICA X 250 g","UNIDAD",2]
["0020","PEGAMENTO TIPO TEROKAL X 1/4 gal",112,"A","73","70","0005","A",112,2016,1004,"B",23,112,"18/06/2015 10:00:33.72","A","04744514","A_SIGA","2","18/06/2015 10:00:33.72","04744514",null,"0",0,0,0,0,"N",0,"UNIDAD",112,null,"UNIDAD",null,null,{"$f":"CONCATENATE(E351,F351,G351,A351)","v":"737000050020"},null,"737000050020","PEGAMENTO TIPO TEROKAL X 1/4 gal","UNIDAD",23]
["0312","PEGAMENTO TIPO TEROKAL X 1/8 L",112,"A","73","70","0005","A",112,2016,1004,"B",23,112,"23/06/2015 10:34:13.983","A","04744514","A_SIGA","2","23/06/2015 10:34:13.983","04744514",null,"0",0,0,0,0,"N",0,"UNIDAD",112,null,"UNIDAD",0,null,{"$f":"CONCATENATE(E352,F352,G352,A352)","v":"737000050312"},null,"737000050312","PEGAMENTO TIPO TEROKAL X 1/8 L","UNIDAD",23]
[null,null,null,null,null,null,null,null,null,null,null,null,null,null,null,null,null,null,null,null,null,null,null,null,null,null,null,null,null,null,null,null,null,null,null,null,null,0,0,0,0]
["0001","IMPRESORA (OTRAS)",112,"A","74","08","3200","A",112,2016,1004,"B",758,112,"23/06/2015 10:34:13.983","A","04744514","A_SIGA","2","23/06/2015 10:34:13.983","04744514",null,"0",0,0,0,0,"S",0,"UNIDAD",112,null,"UNIDAD",null,null,{"$f":"CONCATENATE(E354,F354,G354,A354)","v":"740832000001"},null,"740832000001","IMPRESORA (OTRAS)","UNIDAD",758]
["0012","EQUIPO MULTIFUNCIONAL COPIADORA IMPRESORA SCANNER 19 PPM",112,"A","74","22","2358","A",112,2016,1004,"B",0,112,"01/07/2015 12:50:38.11","A","04744514","A_SIGA","2",null,null,null,"0",0,0,0,null,"S",0,"UNIDAD",112,null,"UNIDAD",0,null,"742223580012",null,"742223580012","EQUIPO MULTIFUNCIONAL COPIADORA IMPRESORA SCANNER 19 PPM","UNIDAD",0]
["0089","PIZARRA ACRILICA DE 1.20 m X 2 m",112,"A","74","64","7305","A",112,2016,1004,"B",1.5,112,"18/06/2015 10:00:33.72","A","04744514","A_SIGA","2","18/06/2015 10:00:33.72","04744514",null,"0",0,0,0,0,"S",0,"UNIDAD",112,null,"UNIDAD",0,null,"746473050089",null,"746473050089","PIZARRA ACRILICA DE 1.20 m X 2 m","UNIDAD",1.5]
["0097","PIZARRA ACRILICA DE 2.40 m X 1.20 m",112,"A","74","64","7305","A",112,2016,1004,"B",130,112,"23/06/2015 10:34:13.983","A","04744514","A_SIGA","2","23/06/2015 10:34:13.983","04744514",null,"0",0,0,0,0,"S",0,"UNIDAD",112,null,"UNIDAD",0,null,"746473050097",null,"746473050097","PIZARRA ACRILICA DE 2.40 m X 1.20 m","UNIDAD",130]
["0108","PIZARRA ACRILICA DE 82.5 cm X 1.20 m CON SUJETADOR DE PAPEL",112,"A","74","64","7305","A",112,2016,1004,"B",58,112,"23/06/2015 10:34:13.983","A","04744514","A_SIGA","2","23/06/2015 10:34:13.983","04744514",null,"0",0,0,0,0,"S",0,"UNIDAD",112,null,"UNIDAD",0,null,"746473050108",null,"746473050108","PIZARRA ACRILICA DE 82.5 cm X 1.20 m CON SUJETADOR DE PAPEL","UNIDAD",58]
["0159","PIZARRA ACRÍLICA 80 cm X 1.15 m",112,"A","74","64","7305","A",112,2016,1004,"B",70,112,"23/06/2015 10:34:13.983","A","04744514","A_SIGA","2","23/06/2015 10:34:13.983","04744514",null,"0",0,0,0,0,"S",0,"UNIDAD",112,null,"UNIDAD",0,null,"746473050159",null,"746473050159","PIZARRA ACRÍLICA 80 cm X 1.15 m","UNIDAD",70]
["0020","SILLA FIJA DE PLASTICO",112,"A","74","64","8255","A",112,2016,1505,"B",24.17,112,"04/06/2015 21:59:24.516","A","02050907","A_SIGA","2","08/06/2015 02:32:33.403","02050907",null,"0",0,0,0,0,"S",0,"UNIDAD",112,null,"UNIDAD",0,null,"746482550020",null,"746482550020","SILLA FIJA DE PLASTICO","UNIDAD",24.17]
[null,null,null,null,null,null,null,null,null,null,null,null,null,null,null,null,null,null,null,null,null,null,null,null,null,null,null,null,null,null,null,null,null,null,null,null,null,0,0,0,0]
["0017","DISKETTE DE 1.44 MB 3.5 in 2HD",112,"A","76","74","0003","A",112,2016,1004,"B",6.8,112,"03/06/2015 10:58:38.11","A","04744514","A_SIGA","2","08/06/2015 14:53:26.64","01980772",null,"0",0,0,0,0,"N",0,"UNIDAD",112,null,"UNIDAD",0,null,{"$f":"CONCATENATE(E362,F362,G362,A362)","v":"767400030017"},null,"767400030017","DISKETTE DE 1.44 MB 3.5 in 2HD","UNIDAD",6.8]
["0045","CD GRABABLE DE 202 MB",112,"A","76","74","0004","A",112,2016,1004,"B",0.8,112,"03/06/2015 10:58:38.11","A","04744514","A_SIGA","2","08/06/2015 14:53:26.64","01980772",null,"0",0,0,0,0,"N",0,"UNIDAD",112,null,"UNIDAD",0,null,"767400040045",null,"767400040045","CD GRABABLE DE 202 MB","UNIDAD",0.8]
["0059","CD GRABABLE DE 700 MB",112,"A","76","74","0004","A",112,2016,1505,"B",55,112,"23/06/2015 02:34:42.186","A","02050907","A_SIGA","2","23/06/2015 02:34:42.186","02050907",null,"0",0,0,0,0,"N",0,"UNIDAD",112,null,"UNIDAD",0,null,"767400040059",null,"767400040059","CD GRABABLE DE 700 MB","UNIDAD",55]
["0083","DISCO DVD - RW DE 4.7 GB",112,"A","76","74","0004","A",112,2016,1004,"B",0.55000000000000004,112,"03/06/2015 10:58:38.11","A","04744514","A_SIGA","2","08/06/2015 14:53:26.64","01980772",null,"0",0,0,0,0,"N",0,"UNIDAD",112,null,"UNIDAD",0,null,"767400040083",null,"767400040083","DISCO DVD - RW DE 4.7 GB","UNIDAD",0.55000000000000004]
["0047","TINTA DE IMPRESION PARA HP COD. REF. 51629A NEGRO",112,"A","76","74","0005","A",112,2016,1004,"B",57.8,112,"23/06/2015 10:34:13.983","A","04744514","A_SIGA","2","23/06/2015 10:34:13.983","04744514",null,"0",0,0,0,0,"N",0,"UNIDAD",112,null,"UNIDAD",null,null,"767400050047",null,"767400050047","TINTA DE IMPRESION PARA HP COD. REF. 51629A NEGRO","UNIDAD",57.8]
["0214","TINTA DE IMPRESION PARA HP COD. REF. C6615D NEGRO",112,"A","76","74","0005","A",112,2016,1004,"B",65,112,"23/06/2015 10:34:13.983","A","04744514","A_SIGA","2","23/06/2015 10:34:13.983","04744514",null,"0",0,0,0,0,"N",0,"UNIDAD",112,null,"UNIDAD",null,null,"767400050214",null,"767400050214","TINTA DE IMPRESION PARA HP COD. REF. C6615D NEGRO","UNIDAD",65]
["0215","TINTA DE IMPRESION PARA HP COD. REF. C6625A COLOR",112,"A","76","74","0005","A",112,2016,1004,"B",119,112,"23/06/2015 10:34:13.983","A","04744514","A_SIGA","2","23/06/2015 10:34:13.983","04744514",null,"0",0,0,0,0,"N",0,"UNIDAD",112,null,"UNIDAD",null,null,"767400050215",null,"767400050215","TINTA DE IMPRESION PARA HP COD. REF. C6625A COLOR","UNIDAD",119]
["0235","TINTA DE IMPRESION PARA LEXMARK COD. REF. 18L0042 COLOR",112,"A","76","74","0005","A",112,2016,1004,"B",70,112,"04/06/2015 15:07:32.983","A","01980772","ESCAL1","2","08/06/2015 14:53:26.64","01980772",null,"0",0,0,0,0,"N",0,"UNIDAD",112,null,"UNIDAD",0,null,"767400050235",null,"767400050235","TINTA DE IMPRESION PARA LEXMARK COD. REF. 18L0042 COLOR","UNIDAD",70]
["0317","TINTA DE IMPRESION PARA LEXMARK COD. REF. 18L0032 NEGRO",112,"A","76","74","0005","A",112,2016,1004,"B",75,112,"04/06/2015 15:07:32.983","A","01980772","ESCAL1","2","08/06/2015 14:53:26.64","01980772",null,"0",0,0,0,0,"N",0,"UNIDAD",112,null,"UNIDAD",0,null,"767400050317",null,"767400050317","TINTA DE IMPRESION PARA LEXMARK COD. REF. 18L0032 NEGRO","UNIDAD",75]
["1225","TINTA DE IMPRESION PARA HP COD. REF. 51639A NEGRO",112,"A","76","74","0005","A",112,2016,1004,"B",57.8,112,"04/06/2015 15:07:32.983","A","01980772","ESCAL1","2","08/06/2015 14:53:26.64","01980772",null,"0",0,0,0,0,"N",0,"UNIDAD",112,null,"UNIDAD",0,null,"767400051225",null,"767400051225","TINTA DE IMPRESION PARA HP COD. REF. 51639A NEGRO","UNIDAD",57.8]
["0168","TONER DE IMPRESION PARA HP COD. REF. 49A Q5949A NEGRO",112,"A","76","74","0006","A",112,2016,1004,"B",225,112,"23/06/2015 10:34:13.983","A","04744514","A_SIGA","2","23/06/2015 10:34:13.983","04744514",null,"0",0,0,0,0,"N",0,"UNIDAD",112,null,"UNIDAD",0,null,"767400060168",null,"767400060168","TONER DE IMPRESION PARA HP COD. REF. 49A Q5949A NEGRO","UNIDAD",225]
["0354","TONER DE IMPRESION PARA HP COD. REF. 12A Q2612A NEGRO",112,"A","76","74","0006","A",112,2016,1505,"B",235,112,"04/06/2015 21:59:24.516","A","02050907","A_SIGA","2","08/06/2015 02:32:33.403","02050907",null,"0",0,0,0,0,"N",0,"UNIDAD",112,null,"UNIDAD",0,null,"767400060354",null,"767400060354","TONER DE IMPRESION PARA HP COD. REF. 12A Q2612A NEGRO","UNIDAD",235]
["0519","TONER DE IMPRESION PARA KYOCERA COD. REF. TK-57 NEGRO",112,"A","76","74","0006","A",112,2016,1505,"B",235,112,"04/06/2015 21:59:24.516","A","02050907","A_SIGA","2","08/06/2015 02:32:33.403","02050907",null,"0",0,0,0,0,"N",0,"UNIDAD",112,null,"UNIDAD",0,null,"767400060519",null,"767400060519","TONER DE IMPRESION PARA KYOCERA COD. REF. TK-57 NEGRO","UNIDAD",235]
["0525","TONER DE IMPRESION PARA HP COD. REF. Q5950A NEGRO",112,"A","76","74","0006","A",112,2016,1004,"B",225,112,"04/06/2015 15:07:32.983","A","01980772","ESCAL1","2","08/06/2015 14:53:26.64","01980772",null,"0",0,0,0,0,"N",0,"UNIDAD",112,null,"UNIDAD",0,null,"767400060525",null,"767400060525","TONER DE IMPRESION PARA HP COD. REF. Q5950A NEGRO","UNIDAD",225]
["0630","TONER DE IMPRESION PARA HP COD. REF. 36A CB436A NEGRO",112,"A","76","74","0006","A",112,2016,1505,"B",230,112,"04/06/2015 21:59:24.516","A","02050907","A_SIGA","2","08/06/2015 02:32:33.403","02050907",null,"0",0,0,0,0,"N",0,"UNIDAD",112,null,"UNIDAD",0,null,"767400060630",null,"767400060630","TONER DE IMPRESION PARA HP COD. REF. 36A CB436A NEGRO","UNIDAD",230]
["0635","TONER DE IMPRESION PARA HP COD. REF. 35A CB435A NEGRO",112,"A","76","74","0006","A",112,2016,1505,"B",240,112,"04/06/2015 21:59:24.516","A","02050907","A_SIGA","2","08/06/2015 02:32:33.403","02050907",null,"0",0,0,0,0,"N",0,"UNIDAD",112,null,"UNIDAD",0,null,"767400060635",null,"767400060635","TONER DE IMPRESION PARA HP COD. REF. 35A CB435A NEGRO","UNIDAD",240]
["1035","TONER DE IMPRESION PARA HP COD. REF. 85A CE285A NEGRO",112,"A","76","74","0006","A",112,2016,1505,"B",235,112,"04/06/2015 21:59:24.516","A","02050907","A_SIGA","2","08/06/2015 02:32:33.403","02050907",null,"0",0,0,0,0,"N",0,"UNIDAD",112,null,"UNIDAD",0,null,"767400061035",null,"767400061035","TONER DE IMPRESION PARA HP COD. REF. 85A CE285A NEGRO","UNIDAD",235]
["1093","TONER DE IMPRESION PARA KYOCERA COD. REF. TK-162 NEGRO",112,"A","76","74","0006","A",112,2016,1505,"B",218,112,"22/06/2015 20:35:18.393","A","02050907","A_SIGA","2","23/06/2015 02:34:42.186","02050907",null,"0",0,0,0,0,"N",0,"UNIDAD",112,null,"UNIDAD",0,null,"767400061093",null,"767400061093","TONER DE IMPRESION PARA KYOCERA COD. REF. TK-162 NEGRO","UNIDAD",218]
["1218","TONER DE IMPRESION PARA CANON COD. REF. 104 NEGRO",112,"A","76","74","0006","A",112,2016,1505,"B",235,112,"04/06/2015 21:59:24.516","A","02050907","A_SIGA","2","08/06/2015 02:32:33.403","02050907",null,"0",0,0,0,0,"N",0,"UNIDAD",112,null,"UNIDAD",0,null,"767400061218",null,"767400061218","TONER DE IMPRESION PARA CANON COD. REF. 104 NEGRO","UNIDAD",235]
["1508","TONER DE IMPRESION PARA KYOCERA COD. REF. TK 1147 NEGRO",112,"A","76","74","0006","A",112,2016,1004,"B",330,112,"23/06/2015 10:34:13.983","A","04744514","A_SIGA","2","23/06/2015 10:34:13.983","04744514",null,"0",0,0,0,0,"N",0,"UNIDAD",112,null,"UNIDAD",0,null,"767400061508",null,"767400061508","TONER DE IMPRESION PARA KYOCERA COD. REF. TK 1147 NEGRO","UNIDAD",330]
["1600","TÓNER DE IMPRESIÓN PARA HP COD. REF. 35AD CB435AD NEGRO",112,"A","76","74","0006","A",112,2016,1004,"B",240,112,"23/06/2015 10:34:13.983","A","04744514","A_SIGA","2","23/06/2015 10:34:13.983","04744514",null,"0",0,0,0,0,"N",0,"UNIDAD",112,null,"UNIDAD",0,null,"767400061600",null,"767400061600","TÓNER DE IMPRESIÓN PARA HP COD. REF. 35AD CB435AD NEGRO","UNIDAD",240]
["1603","TÓNER DE IMPRESIÓN PARA HP COD. REF. 12AD Q2612AD NEGRO",112,"A","76","74","0006","A",112,2016,1004,"B",220,112,"23/06/2015 10:34:13.983","A","04744514","A_SIGA","2","23/06/2015 10:34:13.983","04744514",null,"0",0,0,0,0,"N",0,"UNIDAD",112,null,"UNIDAD",0,null,"767400061603",null,"767400061603","TÓNER DE IMPRESIÓN PARA HP COD. REF. 12AD Q2612AD NEGRO","UNIDAD",220]
["1998","TONER DE IMPRESION PARA KYOCERA COD. REF. TK 1122 NEGRO",112,"A","76","74","0006","A",112,2016,1505,"B",250,112,"04/06/2015 21:59:24.516","A","02050907","A_SIGA","2","08/06/2015 02:32:33.403","02050907",null,"0",0,0,0,0,"N",0,"UNIDAD",112,null,"UNIDAD",0,null,"767400061998",null,"767400061998","TONER DE IMPRESION PARA KYOCERA COD. REF. TK 1122 NEGRO","UNIDAD",250]
["2034","TONER DE IMPRESION PARA KYOCERA COD. REF. TK 1112 NEGRO",112,"A","76","74","0006","A",112,2016,1505,"B",245,112,"04/06/2015 21:59:24.516","A","02050907","A_SIGA","2","08/06/2015 02:32:33.403","02050907",null,"0",0,0,0,0,"N",0,"UNIDAD",112,null,"UNIDAD",0,null,"767400062034",null,"767400062034","TONER DE IMPRESION PARA KYOCERA COD. REF. TK 1112 NEGRO","UNIDAD",245]
["2115","TONER DE IMPRESION PARA HP COD. REF. 85A CE285AD NEGRO",112,"A","76","74","0006","A",112,2016,1004,"B",235,112,"23/06/2015 10:34:13.983","A","04744514","A_SIGA","2","23/06/2015 10:34:13.983","04744514",null,"0",0,0,0,0,"N",0,"UNIDAD",112,null,"UNIDAD",0,null,"767400062115",null,"767400062115","TONER DE IMPRESION PARA HP COD. REF. 85A CE285AD NEGRO","UNIDAD",235]
["0756","FILTRO DE PANTALLA DE 15 in",112,"A","76","75","0012","A",112,2016,1004,"B",10,112,"23/06/2015 10:34:13.983","A","04744514","A_SIGA","2","23/06/2015 10:34:13.983","04744514",null,"0",0,0,0,0,"N",0,"UNIDAD",112,null,"UNIDAD",0,null,"767500120756",null,{"$f":"+AJ387","v":"767500120756"},{"$f":"+B387","v":"FILTRO DE PANTALLA DE 15 in"},{"$f":"+AG387","v":"UNIDAD"},{"$f":"+M387","v":10}]
["0923","COOLER PARA COMPUTADORA PORTATIL",112,"A","76","75","0012","A",112,2016,1004,"B",40,112,"23/06/2015 10:34:13.983","A","04744514","A_SIGA","2","23/06/2015 10:34:13.983","04744514",null,"0",0,0,0,0,"N",0,"UNIDAD",112,null,"UNIDAD",0,null,"767500120923",null,"767500120923","COOLER PARA COMPUTADORA PORTATIL","UNIDAD",40]
["0005","DATA SWITCH AUTOMATICO DE 4 PUERTOS",112,"A","76","75","0039","A",112,2016,1505,"B",500,112,"04/06/2015 21:59:24.516","A","02050907","A_SIGA","2","08/06/2015 02:32:33.403","02050907",null,"0",0,0,0,0,"N",0,"UNIDAD",112,null,"UNIDAD",0,null,"767500390005",null,"767500390005","DATA SWITCH AUTOMATICO DE 4 PUERTOS","UNIDAD",500]
["0003","MEMORIA PORTATIL USB DE 4 GB",112,"A","76","75","0059","A",112,2016,1004,"B",14,112,"03/06/2015 15:28:35.876","A","01980772","ESCAL1","2","08/06/2015 14:53:26.64","01980772",null,"0",0,0,0,0,"N",0,"UNIDAD",112,null,"UNIDAD",0,null,"767500590003",null,"767500590003","MEMORIA PORTATIL USB DE 4 GB","UNIDAD",14]
["0004","MEMORIA PORTATIL USB DE 8 GB",112,"A","76","75","0059","A",112,2016,1505,"B",30,112,"04/06/2015 21:59:24.516","A","02050907","A_SIGA","2","08/06/2015 02:32:33.403","02050907",null,"0",0,0,0,0,"N",0,"UNIDAD",112,null,"UNIDAD",0,null,"767500590004",null,"767500590004","MEMORIA PORTATIL USB DE 8 GB","UNIDAD",30]
["0005","MEMORIA PORTATIL USB DE 16 GB",112,"A","76","75","0059","A",112,2016,1004,"B",35,112,"18/06/2015 10:00:33.72","A","04744514","A_SIGA","2","18/06/2015 10:00:33.72","04744514",null,"0",0,0,0,0,"N",0,"UNIDAD",112,null,"UNIDAD",0,null,"767500590005",null,"767500590005","MEMORIA PORTATIL USB DE 16 GB","UNIDAD",35]
[null,null,null,null,null,null,null,null,null,null,null,null,null,null,null,null,null,null,null,null,null,null,null,null,null,null,null,null,null,null,null,null,null,null,null,null,null,0,0,0,0]
["0132","FUNDA DE PLASTICO PARA COMPUTADORA X 4 PIEZAS",112,"A","79","14","0003","A",112,2016,1004,"B",8,112,"23/06/2015 10:34:13.983","A","04744514","A_SIGA","2","23/06/2015 10:34:13.983","04744514",null,"0",0,0,0,0,"N",0,"UNIDAD",112,null,"UNIDAD",0,null,{"$f":"CONCATENATE(E394,F394,G394,A394)","v":"791400030132"},null,"791400030132","FUNDA DE PLASTICO PARA COMPUTADORA X 4 PIEZAS","UNIDAD",8]
["0044","COLCHON DE LONA COLOR BLANCO DE 1 PLAZA",112,"A","79","19","0003","A",112,2016,1505,"B",145,112,"17/06/2015 20:52:28.193","A","02050907","A_SIGA","2","18/06/2015 20:51:35.89","02050907",null,"0",0,0,0,0,"N",0,"UNIDAD",112,null,"UNIDAD",0,null,{"$f":"CONCATENATE(E395,F395,G395,A395)","v":"791900030044"},null,"791900030044","COLCHON DE LONA COLOR BLANCO DE 1 PLAZA","UNIDAD",145]
["0021","COLCHONETA DE ESPUMA DE 5 in X 1.90 m X 1.05 m",112,"A","79","19","0008","A",112,2016,1505,"B",120,112,"17/06/2015 20:52:28.193","A","02050907","A_SIGA","2","18/06/2015 20:51:35.89","02050907",null,"0",0,0,0,0,"N",0,"UNIDAD",112,null,"UNIDAD",0,null,{"$f":"CONCATENATE(E396,F396,G396,A396)","v":"791900080021"},null,"791900080021","COLCHONETA DE ESPUMA DE 5 in X 1.90 m X 1.05 m","UNIDAD",120]
[null,null,null,null,null,null,null,null,null,null,null,null,null,null,null,null,null,null,null,null,null,null,null,null,null,null,null,null,null,null,null,null,null,null,null,null,null,0,0,0,0]
["0022","MALETIN PORTADOCUMENTOS DE NAILON TETRON",112,"A","89","03","0001","A",112,2016,1004,"B",38.700000000000003,112,"23/06/2015 10:34:13.983","A","04744514","A_SIGA","2","23/06/2015 10:34:13.983","04744514",null,"0",0,0,0,0,"N",0,"UNIDAD",112,null,"UNIDAD",0,null,{"$f":"CONCATENATE(E398,F398,G398,A398)","v":"890300010022"},null,"890300010022","MALETIN PORTADOCUMENTOS DE NAILON TETRON","UNIDAD",38.700000000000003]
["0045","CORROSPUN 1.00 m X 1.00 m",112,"A","89","04","0001","A",112,2016,1505,"B",1.9,112,"04/06/2015 21:59:24.516","A","02050907","A_SIGA","2","08/06/2015 02:32:33.403","02050907",null,"0",0,0,0,0,"N",0,"UNIDAD",112,null,"UNIDAD",0,null,"890400010045",null,"890400010045","CORROSPUN 1.00 m X 1.00 m","UNIDAD",1.9]
["0150","CORROSPUN 1.00 m X 1.00 m COLOR FUCSIA",112,"A","89","04","0001","A",112,2016,1505,"B",1.9,112,"04/06/2015 21:59:24.516","A","02050907","A_SIGA","2","08/06/2015 02:32:33.403","02050907",null,"0",0,0,0,0,"N",0,"UNIDAD",112,null,"UNIDAD",0,null,"890400010150",null,"890400010150","CORROSPUN 1.00 m X 1.00 m COLOR FUCSIA","UNIDAD",1.9]
["0151","CORROSPUN 1.00 m X 1.00 m COLOR AMARILLO",112,"A","89","04","0001","A",112,2016,1505,"B",1.9,112,"04/06/2015 21:59:24.516","A","02050907","A_SIGA","2","08/06/2015 02:32:33.403","02050907",null,"0",0,0,0,0,"N",0,"UNIDAD",112,null,"UNIDAD",0,null,"890400010151",null,"890400010151","CORROSPUN 1.00 m X 1.00 m COLOR AMARILLO","UNIDAD",1.9]
["0152","CORROSPUN 1.00 m X 1.00 m COLOR CELESTE",112,"A","89","04","0001","A",112,2016,1505,"B",1.9,112,"04/06/2015 21:59:24.516","A","02050907","A_SIGA","2","08/06/2015 02:32:33.403","02050907",null,"0",0,0,0,0,"N",0,"UNIDAD",112,null,"UNIDAD",0,null,"890400010152",null,"890400010152","CORROSPUN 1.00 m X 1.00 m COLOR CELESTE","UNIDAD",1.9]
["0153","CORROSPUN 1.00 m X 1.00 m COLOR VERDE CLARO",112,"A","89","04","0001","A",112,2016,1505,"B",1.9,112,"04/06/2015 21:59:24.516","A","02050907","A_SIGA","2","08/06/2015 02:32:33.403","02050907",null,"0",0,0,0,0,"N",0,"UNIDAD",112,null,"UNIDAD",0,null,"890400010153",null,"890400010153","CORROSPUN 1.00 m X 1.00 m COLOR VERDE CLARO","UNIDAD",1.9]
["0024","TELA CASIMIR X 1.50 m DE ANCHO",73,"A","89","57","0008","A",73,2016,1004,"B",85,73,"18/06/2015 10:00:33.72","A","04744514","A_SIGA","2","18/06/2015 10:00:33.72","04744514",null,"0",0,0,0,0,"N",0,"METRO",73,null,"METRO",0,null,"895700080024",null,"895700080024","TELA CASIMIR X 1.50 m DE ANCHO","METRO",85]
["0124","TELA FRANELA 70 cm X 50 m",112,"A","89","57","0008","A",112,2016,1505,"B",225,112,"04/06/2015 21:59:24.516","A","02050907","A_SIGA","2","21/06/2015 21:57:51.323","02050907",null,"0",0,0,0,0,"N",0,"UNIDAD",112,null,"UNIDAD",0,null,"895700080124",null,"895700080124","TELA FRANELA 70 cm X 50 m","UNIDAD",225]
["0160","TELA YUTE X 1 m DE ANCHO",73,"A","89","57","0008","A",73,2016,1004,"B",38.700000000000003,73,"18/06/2015 10:00:33.72","A","04744514","A_SIGA","2","18/06/2015 10:00:33.72","04744514",null,"0",0,0,0,0,"N",0,"METRO",73,null,"METRO",0,null,"895700080160",null,"895700080160","TELA YUTE X 1 m DE ANCHO","METRO",38.700000000000003]
["0666","TELA FRANELA 1.00 m X 1.80 m COLOR VERDE",112,"A","89","57","0008","A",112,2016,1004,"B",5.3,112,"23/06/2015 10:34:13.983","A","04744514","A_SIGA","2","23/06/2015 10:34:13.983","04744514",null,"0",0,0,0,0,"N",0,"UNIDAD",112,null,"UNIDAD",0,null,"895700080666",null,"895700080666","TELA FRANELA 1.00 m X 1.80 m COLOR VERDE","UNIDAD",5.3]
["1005","TELA FRANELA 1.00 m X 1.50 m",112,"A","89","57","0008","A",112,2016,1004,"B",5.5,112,"23/06/2015 10:34:13.983","A","04744514","A_SIGA","2","23/06/2015 10:34:13.983","04744514",null,"0",0,0,0,0,"N",0,"UNIDAD",112,null,"UNIDAD",0,null,"895700081005",null,"895700081005","TELA FRANELA 1.00 m X 1.50 m","UNIDAD",5.5]
["0002","COLA DE RATA X 10 m",112,"A","89","57","0012","A",112,2016,1004,"B",7,112,"23/06/2015 10:34:13.983","A","04744514","A_SIGA","2","23/06/2015 10:34:13.983","04744514",null,"0",0,0,0,0,"N",0,"UNIDAD",112,null,"UNIDAD",0,null,"895700120002",null,"895700120002","COLA DE RATA X 10 m","UNIDAD",7]

{"sheet":"LISTADO IIEE","index":5,"n_rows":875,"n_cols":13,"rows_kept":875,"cut":false,"hidden":true,"merged":[]}
["N°","Distrito","Centro Poblado","Cód. Mod.","Nombre de IE","Nivel","Modalidad","Tipo IE","Total  de estudiantes matriculados (*)",null,"area","servicio de energia "]
[509,"PUNO","PUNO","1023431","I.E.I.  - 327","I.E.I.","Educación Básica Regular      ","A1  - Pública - Sector Educación                                  ",54,{"$f":"+B2","v":"PUNO"},"Urbana",null,60.61]
[827,"PUNO","JAYLLIHUAYA","1024074","I.E.S.  - CARLOS DANTE NAVA","I.E.S.","Educación Básica Regular      ","A1  - Pública - Sector Educación                                  ",50,"PUNO","Urbana",645.95000000000005,158.90999999999997]
[365,"PUNO","VILLA COPA CABANA","1571462","I.E.I.  - 239 NIÑO JESUS DE PRAGA","I.E.I.","Educación Básica Regular      ","A1  - Pública - Sector Educación                                  ",9,"PUNO","Urbana",56.05,170.56]
[502,"PUNO","LAYKAKOTA","0618363","I.E.I.  - 274","I.E.I.","Educación Básica Regular      ","A1  - Pública - Sector Educación                                  ",76,"PUNO","Urbana",177.35,266.82]
[497,"PUNO","SANTA ROSA","0701482","I.E.I.  - 322","I.E.I.","Educación Básica Regular      ","A1  - Pública - Sector Educación                                  ",74,"PUNO","Urbana",92.149999999999991,302.25]
[506,"PUNO","BARRIO LLAVINI","0618371","I.E.I.  - 275","I.E.I.","Educación Básica Regular      ","A1  - Pública - Sector Educación                                  ",62,"PUNO","Urbana",70.75,332.47999999999996]
[355,"PUNO","PUNO","1679356","I.E.I.  - VALLECITO","I.E.I.","Educación Básica Regular      ","A1  - Pública - Sector Educación                                  ",20,"PUNO","Urbana",42.25,333.68999999999994]
[504,"PUNO","PUNO","0618397","I.E.I.  - 278","I.E.I.","Educación Básica Regular      ","A1  - Pública - Sector Educación                                  ",110,"PUNO","Urbana",670.45,365]
[841,"PUNO","PUNO","0701557","I.E.S.  - SAN JOSE","I.E.S.","Educación Básica Regular      ","A1  - Pública - Sector Educación                                  ",102,"PUNO","Urbana",719.9,379.15999999999997]
[596,"PUNO","PUNO","0230235","I.E.P.   - 70013","I.E.P. ","Educación Básica Regular      ","A1  - Pública - Sector Educación                                  ",40,"PUNO","Urbana",857.7,392.51]
[362,"PUNO","AZIRUNI","1556323","I.E.I.  - 1211 CUIDAD JARDIN","I.E.I.","Educación Básica Regular      ","A1  - Pública - Sector Educación                                  ",68,"PUNO","Urbana",287.70000000000005,395.73]
[608,"PUNO","JAYLLIHUAYA","0230979","I.E.P.   - 70090","I.E.P. ","Educación Básica Regular      ","A1  - Pública - Sector Educación                                  ",44,"PUNO","Urbana",1364.6,402.49]
[619,"PUNO","PUNO","0804286","I.E.P.   - 70717","I.E.P. ","Educación Básica Regular      ","A1  - Pública - Sector Educación                                  ",59,"PUNO","Urbana",272.60000000000002,411.79999999999995]
[494,"PUNO","MAGISTERIAL","0548511","I.E.I.  - 248","I.E.I.","Educación Básica Regular      ","A1  - Pública - Sector Educación                                  ",87,"PUNO","Urbana",139.5,428.29]
[591,"PUNO","PUNO","0230284","I.E.P.   - 70018 SAN JOSE DE HUARAYA","I.E.P. ","Educación Básica Regular      ","A1  - Pública - Sector Educación                                  ",91,"PUNO","Urbana",759.10000000000014,481.3]
[610,"PUNO","SAN MARTIN","0230722","I.E.P.   - 70064 SAN MARTIN DE PORRES","I.E.P. ","Educación Básica Regular      ","A1  - Pública - Sector Educación                                  ",48,"PUNO","Urbana",335.99999999999994,508.86]
[624,"PUNO","PUNO","0618439","I.E.P.   - 70657","I.E.P. ","Educación Básica Regular      ","A1  - Pública - Sector Educación                                  ",19,"PUNO","Urbana",2104.85,568.03000000000009]
[487,"PUNO","CHACARILLA DEL LAGO","0474353","I.E.I.  - 219 SANTA ROSA DE LIMA","I.E.I.","Educación Básica Regular      ","A1  - Pública - Sector Educación                                  ",76,"PUNO","Urbana",74.7,599.1]
[501,"PUNO","SAN MARTIN","0660258","I.E.I.  - 284 CARLOS DREYER","I.E.I.","Educación Básica Regular      ","A1  - Pública - Sector Educación                                  ",64,"PUNO","Urbana",53.050000000000004,644.49]
[840,"PUNO","PUNO","0618447","I.E.S.  - POLITECNICO HUASCAR","I.E.S.","Educación Básica Regular      ","A1  - Pública - Sector Educación                                  ",246,"PUNO","Urbana",6346.3,720.84]
[477,"PUNO","LAYKAKOTA","0229682","I.E.I.  - 208","I.E.I.","Educación Básica Regular      ","A1  - Pública - Sector Educación                                  ",140,"PUNO","Urbana",115.05000000000001,729.52]
[601,"PUNO","SALCEDO","0230888","I.E.P.   - 70081","I.E.P. ","Educación Básica Regular      ","A1  - Pública - Sector Educación                                  ",132,"PUNO","Urbana",1501.35,882.2]
[476,"PUNO","JOSE ENCINAS","0229674","I.E.I.  - 207 JOSE ANTONIO ENCINAS","I.E.I.","Educación Básica Regular      ","A1  - Pública - Sector Educación                                  ",150,"PUNO","Urbana",723.80000000000007,892.5]
[606,"PUNO","PUNO","0230334","I.E.P.   - 70023","I.E.P. ","Educación Básica Regular      ","A1  - Pública - Sector Educación                                  ",116,"PUNO","Urbana",1048.55,1093.04]
[489,"PUNO","2 DE MAYO","0539056","I.E.I.  - 379","I.E.I.","Educación Básica Regular      ","A1  - Pública - Sector Educación                                  ",28,"PUNO","Urbana",76.95,1157.98]
[836,"PUNO","PUNO","0578823","I.E.S.  - CARLOS RUBINA BURGOS","I.E.S.","Educación Básica Regular      ","A1  - Pública - Sector Educación                                  ",446,"PUNO","Urbana",2019.4499999999998,1295.6100000000001]
[625,"PUNO","2 DE MAYO","0618413","I.E.P.   - 70655 INTERCULTURAL PUNO","I.E.P. ","Educación Básica Regular      ","A1  - Pública - Sector Educación                                  ",21,"PUNO","Urbana",584.35,1560.81]
[588,"PUNO","CHANU CHANU ETAPA 1","0230557","I.E.P.   - 70045","I.E.P. ","Educación Básica Regular      ","A1  - Pública - Sector Educación                                  ",136,"PUNO","Urbana",1817.3,1618.7]
[615,"PUNO","PUNO","1025758","I.E.P.   - 70801 NUESTRA SEÑORA DE GUADALUPE","I.E.P. ","Educación Básica Regular      ","A1  - Pública - Sector Educación                                  ",56,"PUNO","Urbana",626.04999999999995,1660.4299999999998]
[508,"PUNO","ALTO BELLAVISTA","1025576","I.E.I.  - 330","I.E.I.","Educación Básica Regular      ","A1  - Pública - Sector Educación                                  ",58,"PUNO","Urbana",597.25,1678.8100000000002]
[478,"PUNO","PORTEÑO","0229526","I.E.I.  - 192","I.E.I.","Educación Básica Regular      ","A1  - Pública - Sector Educación                                  ",204,"PUNO","Urbana",9085.0999999999985,2137.46]
[623,"PUNO","RICARDO PALMA","0618421","I.E.P.   - 70656","I.E.P. ","Educación Básica Regular      ","A1  - Pública - Sector Educación                                  ",76,"PUNO","Urbana",765.09999999999991,2348.8900000000003]
[604,"PUNO","BELLAVISTA","0230359","I.E.P.   - 70025 INDEPENDENCIA NACIONAL","I.E.P. ","Educación Básica Regular      ","A1  - Pública - Sector Educación                                  ",398,"PUNO","Urbana",null,2391.9899999999998]
[479,"PUNO","SAN ANTONIO","0229534","I.E.I.  - 193 CLUB DE LEONES","I.E.I.","Educación Básica Regular      ","A1  - Pública - Sector Educación                                  ",262,"PUNO","Urbana",858.25,2419.19]
[499,"PUNO","PUNO","0701508","I.E.I.  - 290","I.E.I.","Educación Básica Regular      ","A1  - Pública - Sector Educación                                  ",63,"PUNO","Urbana",108.15,2442.36]
[511,"PUNO","VILLA DEL LAGO","1023316","I.E.I.  - 324 DIVINO NIÑO JESUS","I.E.I.","Educación Básica Regular      ","A1  - Pública - Sector Educación                                  ",122,"PUNO","Urbana",358.5,2486.6200000000003]
[498,"PUNO","TORRES SAN CARLOS","0701490","I.E.I.  - 287","I.E.I.","Educación Básica Regular      ","A1  - Pública - Sector Educación                                  ",86,"PUNO","Urbana",75.8,2697.0200000000004]
[486,"PUNO","PUNO","0506733","I.E.I.  - 224","I.E.I.","Educación Básica Regular      ","A1  - Pública - Sector Educación                                  ",169,"PUNO","Urbana",2278.4499999999998,2776.4900000000002]
[584,"PUNO","SANTA ROSA","0474361","I.E.P.   - 70623","I.E.P. ","Educación Básica Regular      ","A1  - Pública - Sector Educación                                  ",441,"PUNO","Urbana",2334,3430.9000000000005]
[603,"PUNO","PUNO","0230144","I.E.P.   - 70004","I.E.P. ","Educación Básica Regular      ","A1  - Pública - Sector Educación                                  ",56,"PUNO","Urbana",2976.3500000000004,3636.9400000000005]
[598,"PUNO","PORTEÑO","0230201","I.E.P.   - 70010 GRAN UNIDAD ESCOLAR SAN CARLOS","I.E.P. ","Educación Básica Regular      ","A1  - Pública - Sector Educación                                  ",1031,"PUNO","Urbana",6203.7499999999991,3689.0299999999997]
[585,"PUNO","VALLECITO","0230458","I.E.P.   - 70035","I.E.P. ","Educación Básica Regular      ","A1  - Pública - Sector Educación                                  ",354,"PUNO","Urbana",1303.1500000000001,4355.880000000001]
[475,"PUNO","PUNO","0229575","I.E.I.  - 197","I.E.I.","Educación Básica Regular      ","A1  - Pública - Sector Educación                                  ",213,"PUNO","Urbana",921.05,4608.41]
[605,"PUNO","HUAJSAPATA","0230110","I.E.P.   - 70001","I.E.P. ","Educación Básica Regular      ","A1  - Pública - Sector Educación                                  ",573,"PUNO","Urbana",6297.3499999999995,5005.08]
[589,"PUNO","LAYKAKOTA","0230342","I.E.P.   - 70024","I.E.P. ","Educación Básica Regular      ","A1  - Pública - Sector Educación                                  ",545,"PUNO","Urbana",3354.8500000000004,5039.8499999999995]
[831,"PUNO","VICTORIA","0239814","I.E.S.  - 45 EMILIO ROMERO PADILLA","I.E.S.","Educación Básica Regular      ","A1  - Pública - Sector Educación                                  ",990,"PUNO","Urbana",6912.7999999999993,5382.9199999999992]
[621,"PUNO","SAN ANTONIO","1029818","I.E.P.   - 70803 SAN ANTONIO DE PADUA","I.E.P. ","Educación Básica Regular      ","A1  - Pública - Sector Educación                                  ",59,"PUNO","Urbana",7138.8,5972.17]
[594,"PUNO","VICTORIA","0230151","I.E.P.   - 70005 CORAZON DE JESUS","I.E.P. ","Educación Básica Regular      ","A1  - Pública - Sector Educación                                  ",1093,"PUNO","Urbana",5679.9500000000007,6174.1099999999988]
[514,"PUNO","AZIRUNI","1023233","I.E.I.  - 294","I.E.I.","Educación Básica Regular      ","A1  - Pública - Sector Educación                                  ",176,"PUNO","Urbana",144.39999999999998,7733.6099999999988]
[837,"PUNO","SALCEDO","0239798","I.E.S.  - SAN JUAN BOSCO","I.E.S.","Educación Básica Regular      ","A1  - Pública - Sector Educación                                  ",309,"PUNO","Urbana",9224.4500000000007,7894.6100000000006]
[597,"PUNO","PORTEÑO","0230367","I.E.P.   - 70026","I.E.P. ","Educación Básica Regular      ","A1  - Pública - Sector Educación                                  ",152,"PUNO","Urbana",2324.8000000000002,8068.6900000000005]
[505,"PUNO","PUNO","0618405","I.E.I.  - 279","I.E.I.","Educación Básica Regular      ","A1  - Pública - Sector Educación                                  ",93,"PUNO","Urbana",648.15000000000009,8905.41]
[829,"PUNO","ORKAPATA","0240259","I.E.S.  - SANTA ROSA","I.E.S.","Educación Básica Regular      ","A1  - Pública - Sector Educación                                  ",1076,"PUNO","Urbana",4360,9447.1299999999992]
[617,"PUNO","VILLA DEL LAGO","0804294","I.E.P.   - 70718","I.E.P. ","Educación Básica Regular      ","A1  - Pública - Sector Educación                                  ",155,"PUNO","Urbana",6204.2,9810.8999999999978]
[593,"PUNO","MAGISTERIAL","0230136","I.E.P.   - 70003 SAGRADO CORAZON DE JESUS","I.E.P. ","Educación Básica Regular      ","A1  - Pública - Sector Educación                                  ",718,"PUNO","Urbana",5261.15,10089.220000000001]
[496,"PUNO","CHANU CHANU ETAPA 1","0574970","I.E.I.  - 255","I.E.I.","Educación Básica Regular      ","A1  - Pública - Sector Educación                                  ",257,"PUNO","Urbana",2110.8000000000006,10569.419999999998]
[586,"PUNO","PORTEÑO","0243857","I.E.P.   - 71001 ALMIRANTE MIGUEL GRAU","I.E.P. ","Educación Básica Regular      ","A1  - Pública - Sector Educación                                  ",1075,"PUNO","Urbana",8502.0499999999993,10807.49]
[473,"PUNO","PUNO","0229559","I.E.I.  - 195 MARIA AUXILIADORA","I.E.I.","Educación Básica Regular      ","A1  - Pública - Sector Educación                                  ",306,"PUNO","Urbana",43155.700000000004,12921.57]
[835,"PUNO","TUPAC AMARU","0239822","I.E.S.  - 32","I.E.S.","Educación Básica Regular      ","A1  - Pública - Sector Educación                                  ",762,"PUNO","Urbana",6941.9,14415.3]
[474,"PUNO","PUNO","0229567","I.E.I.  - 196 GLORIOSO SAN CARLOS","I.E.I.","Educación Básica Regular      ","A1  - Pública - Sector Educación                                  ",239,"PUNO","Urbana",null,17712.850000000002]
[834,"PUNO","PORTEÑO","0240176","I.E.S.  - GRAN UNIDAD ESCOLAR SAN CARLOS","I.E.S.","Educación Básica Regular      ","A1  - Pública - Sector Educación                                  ",1657,"PUNO","Urbana",17964.700000000004,26644.140000000003]
[839,"PUNO","PUNO","0240184","I.E.S.  - GLORIOSO SAN CARLOS","I.E.S.","Educación Básica Regular      ","A1  - Pública - Sector Educación                                  ",1163,"PUNO","Urbana",28818.55,28980.609999999997]
[705,"ACORA","AMPARANI","0231100","I.E.P.   - 70103","I.E.P. ","Educación Básica Regular      ","A1  - Pública - Sector Educación                                  ",47,"ACORA","Rural",13.95]
[255,"COATA","COATA","0229617","I.E.I.  - 261 SAN AGUSTIN","I.E.I.","Educación Básica Regular      ","A1  - Pública - Sector Educación                                  ",34,"COATA","Urbana",36.4]
[512,"PUNO","JAYLLIHUAYA","1023274","I.E.I.  - 296","I.E.I.","Educación Básica Regular      ","A1  - Pública - Sector Educación                                  ",16,{"$f":"+B66","v":"PUNO"},"Urbana",38.349999999999994]
[700,"ACORA","PIRCO","0231613","I.E.P.   - 70154","I.E.P. ","Educación Básica Regular      ","A1  - Pública - Sector Educación                                  ",12,"ACORA","Rural",38.700000000000003]
[645,"ACORA","ANCCACCA","0559179","I.E.P.   - 71544","I.E.P. ","Educación Básica Regular      ","A1  - Pública - Sector Educación                                  ",18,"ACORA","Rural",41]
[743,"SAN ANTONIO","CRUSANI","0660332","I.E.P.   - 70697","I.E.P. ","Educación Básica Regular      ","A1  - Pública - Sector Educación                                  ",9,"SAN ANTONIO","Rural",42]
[856,"PLATERIA","CARUCAYA","1024082","I.E.S.  - GAMALIEL CHURATA","I.E.S.","Educación Básica Regular      ","A1  - Pública - Sector Educación                                  ",32,"PLATERIA","Rural",42]
[747,"COATA","UQUISILLA","0230805","I.E.P.   - 70072","I.E.P. ","Educación Básica Regular      ","A1  - Pública - Sector Educación                                  ",35,"COATA","Rural",42.750000000000007]
[181,"CAPACHICA","YAPURA","1023324","I.E.I.  - 297","I.E.I.","Educación Básica Regular      ","A1  - Pública - Sector Educación                                  ",8,"CAPACHICA","Rural",43.05]
[569,"CAPACHICA","ISAÑURA","0230318","I.E.P.   - 70021","I.E.P. ","Educación Básica Regular      ","A1  - Pública - Sector Educación                                  ",38,"CAPACHICA","Rural",43.05]
[698,"ACORA","MOCARAYA","0231381","I.E.P.   - 70131","I.E.P. ","Educación Básica Regular      ","A1  - Pública - Sector Educación                                  ",15,"ACORA","Rural",43.05]
[759,"PLATERIA","ANGOSTURA","0231738","I.E.P.   - 70166","I.E.P. ","Educación Básica Regular      ","A1  - Pública - Sector Educación                                  ",1,"PLATERIA","Rural",43.05]
[674,"ACORA","HUAYCHANI","0231704","I.E.P.   - 70163","I.E.P. ","Educación Básica Regular      ","A1  - Pública - Sector Educación                                  ",7,"ACORA","Rural",43.3]
[760,"PLATERIA","CARUCAYA","0231092","I.E.P.   - 70102","I.E.P. ","Educación Básica Regular      ","A1  - Pública - Sector Educación                                  ",13,"PLATERIA","Rural",44.4]
[692,"ACORA","SAN CARLOS","0231779","I.E.P.   - 70170","I.E.P. ","Educación Básica Regular      ","A1  - Pública - Sector Educación                                  ",12,"ACORA","Rural",45.2]
[660,"PICHACANI","ANCACCA","0474338","I.E.P.   - 70622","I.E.P. ","Educación Básica Regular      ","A1  - Pública - Sector Educación                                  ",49,"PICHACANI","Rural",45.900000000000006]
[223,"CHUCUITO","CUSIPATA","1025725","I.E.I.  - 329","I.E.I.","Educación Básica Regular      ","A1  - Pública - Sector Educación                                  ",14,"CHUCUITO","Rural",46.6]
[719,"CHUCUITO","ICHU RAYA","0231423","I.E.P.   - 70135","I.E.P. ","Educación Básica Regular      ","A1  - Pública - Sector Educación                                  ",7,"CHUCUITO","Rural",46.6]
[693,"ACORA","CCACCA","0231068","I.E.P.   - 70099","I.E.P. ","Educación Básica Regular      ","A1  - Pública - Sector Educación                                  ",4,"ACORA","Rural",47]
[752,"COATA","PUTUCUNI","0230755","I.E.P.   - 70067 FRANCISCO BOLOGNESI","I.E.P. ","Educación Básica Regular      ","A1  - Pública - Sector Educación                                  ",60,"COATA","Rural",47.000000000000007]
[95,"ACORA","SACUYO","0229641","I.E.I.  - 204","I.E.I.","Educación Básica Regular      ","A1  - Pública - Sector Educación                                  ",14,"ACORA","Rural",47.9]
[302,"PICHACANI","JATUCACHI","1584846","I.E.I.  - 1295 LOS NEVADITOS","I.E.I.","Educación Básica Regular      ","A1  - Pública - Sector Educación                                  ",17,"PICHACANI","Rural",48.9]
[695,"ACORA","HUANCARTINQUIHUI","0231605","I.E.P.   - 70153","I.E.P. ","Educación Básica Regular      ","A1  - Pública - Sector Educación                                  ",8,"ACORA","Rural",48.95]
[602,"PUNO","OJHERANI","0231043","I.E.P.   - 70097","I.E.P. ","Educación Básica Regular      ","A1  - Pública - Sector Educación                                  ",14,"PUNO","Rural",50.3]
[806,"ACORA","TAYPICIRCA","1027820","I.E.S.  - TAIPICIRCA","I.E.S.","Educación Básica Regular      ","A1  - Pública - Sector Educación                                  ",53,"ACORA","Rural",50.7]
[642,"ACORA","SAN JOSE DE CALALA","0799411","I.E.P.   - 70741","I.E.P. ","Educación Básica Regular      ","A1  - Pública - Sector Educación                                  ",5,"ACORA","Rural",51.650000000000006]
[96,"ACORA","ACORA","0229542","I.E.I.  - 194 CORAZON DE JESUS","I.E.I.","Educación Básica Regular      ","A1  - Pública - Sector Educación                                  ",124,"ACORA","Urbana",52.199999999999996]
[723,"CHUCUITO","CONCACHI","0231019","I.E.P.   - 70094 NIÑO JESUS PIRAPI","I.E.P. ","Educación Básica Regular      ","A1  - Pública - Sector Educación                                  ",7,"CHUCUITO","Rural",52.75]
[300,"PAUCARCOLLA","PAUCARCOLLA","0513192","I.E.I.  - 323","I.E.I.","Educación Básica Regular      ","A1  - Pública - Sector Educación                                  ",22,"PAUCARCOLLA","Urbana",53.35]
[778,"PAUCARCOLLA","MORO","1571587","I.E.S.  - CESAR VALLEJO","I.E.S.","Educación Básica Regular      ","A1  - Pública - Sector Educación                                  ",51,"PAUCARCOLLA","Rural",53.8]
[709,"ACORA","HUILASIPI","0549105","I.E.P.   - 70678","I.E.P. ","Educación Básica Regular      ","A1  - Pública - Sector Educación                                  ",27,"ACORA","Rural",54.600000000000009]
[661,"PICHACANI","LORIPONGO","0559443","I.E.P.   - 70721","I.E.P. ","Educación Básica Regular      ","A1  - Pública - Sector Educación                                  ",4,"PICHACANI","Rural",55.4]
[561,"PAUCARCOLLA","MACHALLATA","0559294","I.E.P.   - 70645","I.E.P. ","Educación Básica Regular      ","A1  - Pública - Sector Educación                                  ",6,"PAUCARCOLLA","Rural",56.099999999999994]
[678,"TIQUILLACA","HACIENDA CHINGARANE","0477976","I.E.P.   - 70707","I.E.P. ","Educación Básica Regular      ","A1  - Pública - Sector Educación                                  ",4,"TIQUILLACA","Rural",56.6]
[583,"VILQUE","MACHACMARCA","0474544","I.E.P.   - 70719","I.E.P. ","Educación Básica Regular      ","A1  - Pública - Sector Educación                                  ",22,"VILQUE","Rural",56.600000000000009]
[331,"PICHACANI","LARAQUERI","0474627","I.E.I.  - 225","I.E.I.","Educación Básica Regular      ","A1  - Pública - Sector Educación                                  ",47,"PICHACANI","Urbana",56.95]
[614,"PUNO","CHIMU","0231670","I.E.P.   - 70160","I.E.P. ","Educación Básica Regular      ","A1  - Pública - Sector Educación                                  ",14,"PUNO","Rural",58.55]
[647,"PICHACANI","ÑUÑUMARCA","0231621","I.E.P.   - 70155","I.E.P. ","Educación Básica Regular      ","A1  - Pública - Sector Educación                                  ",10,"PICHACANI","Rural",58.75]
[182,"CAPACHICA","LLACHON","1025717","I.E.I.  - 298","I.E.I.","Educación Básica Regular      ","A1  - Pública - Sector Educación                                  ",13,"CAPACHICA","Rural",59.050000000000004]
[750,"COATA","CANDILE","0230789","I.E.P.   - 70070","I.E.P. ","Educación Básica Regular      ","A1  - Pública - Sector Educación                                  ",11,"COATA","Rural",60.45]
[256,"COATA","SORAZA","1025477","I.E.I.  - 289","I.E.I.","Educación Básica Regular      ","A1  - Pública - Sector Educación                                  ",29,"COATA","Rural",61.2]
[330,"PICHACANI","PICHACANI","0539858","I.E.I.  - 268","I.E.I.","Educación Básica Regular      ","A1  - Pública - Sector Educación                                  ",14,"PICHACANI","Rural",66.349999999999994]
[663,"ACORA","SACUYO","0227009","I.E.P.   - 70709","I.E.P. ","Educación Básica Regular      ","A1  - Pública - Sector Educación                                  ",24,"ACORA","Rural",66.55]
[708,"ACORA","PARAPICHUZA","0799445","I.E.P.   - 70744","I.E.P. ","Educación Básica Regular      ","A1  - Pública - Sector Educación                                  ",14,"ACORA","Rural",67.2]
[696,"ACORA","ISCACHURO","0230920","I.E.P.   - 70085","I.E.P. ","Educación Básica Regular      ","A1  - Pública - Sector Educación                                  ",16,"ACORA","Rural",73.349999999999994]
[555,"VILQUE","VILQUE","0229732","I.E.I.  - 213","I.E.I.","Educación Básica Regular      ","A1  - Pública - Sector Educación                                  ",48,"VILQUE","Urbana",77.599999999999994]
[710,"ACORA","JACHACACHI","0615237","I.E.P.   - 70710","I.E.P. ","Educación Básica Regular      ","A1  - Pública - Sector Educación                                  ",11,"ACORA","Rural",77.850000000000009]
[677,"TIQUILLACA","CHILA","0503029","I.E.P.   - 70628","I.E.P. ","Educación Básica Regular      ","A1  - Pública - Sector Educación                                  ",15,"TIQUILLACA","Rural",78.349999999999994]
[265,"HUATA","HUATTA","0487348","I.E.I.  - 215","I.E.I.","Educación Básica Regular      ","A1  - Pública - Sector Educación                                  ",49,"HUATA","Urbana",82.600000000000009]
[795,"ACORA","AMPARANI","0615351","I.E.S.  - JOSE ANTONIO ENCINAS","I.E.S.","Educación Básica Regular      ","A1  - Pública - Sector Educación                                  ",91,"ACORA","Rural",83.55]
[702,"ACORA","LACACHI","0231365","I.E.P.   - 70129","I.E.P. ","Educación Básica Regular      ","A1  - Pública - Sector Educación                                  ",12,"ACORA","Rural",84.300000000000011]
[679,"ACORA","CUSINI","0231142","I.E.P.   - 70107","I.E.P. ","Educación Básica Regular      ","A1  - Pública - Sector Educación                                  ",22,"ACORA","Rural",84.65]
[850,"PICHACANI","HUACOCHULLO","1025808","I.E.S.  - HUACCOCHULLO","I.E.S.","Educación Básica Regular      ","A1  - Pública - Sector Educación                                  ",37,"PICHACANI","Rural",85.45]
[285,"MAÑAZO","MAÑAZO","0229690","I.E.I.  - 209","I.E.I.","Educación Básica Regular      ","A1  - Pública - Sector Educación                                  ",52,"MAÑAZO","Urbana",89.2]
[782,"CAPACHICA","ISAÑURA","1364629","I.E.S.  - ISAÑURA","I.E.S.","Educación Básica Regular      ","A1  - Pública - Sector Educación                                  ",40,"CAPACHICA","Rural",93.2]
[776,"PLATERIA","AQUECHIA","0516740","I.E.P.   - 70660","I.E.P. ","Educación Básica Regular      ","A1  - Pública - Sector Educación                                  ",7,"PLATERIA","Rural",97.899999999999991]
[635,"PICHACANI","CUTIMBO","1029966","I.E.P.   - 70722","I.E.P. ","Educación Básica Regular      ","A1  - Pública - Sector Educación                                  ",17,"PICHACANI","Rural",102.25000000000001]
[225,"CHUCUITO","CHUCUITO","0229666","I.E.I.  - 206","I.E.I.","Educación Básica Regular      ","A1  - Pública - Sector Educación                                  ",44,"CHUCUITO","Urbana",103.55]
[746,"COATA","JOCHI SAN FRANCISCO","0631291","I.E.P.   - 70667","I.E.P. ","Educación Básica Regular      ","A1  - Pública - Sector Educación                                  ",52,"COATA","Urbana",105.2]
[564,"CAPACHICA","CHILLORA","0230292","I.E.P.   - 70019","I.E.P. ","Educación Básica Regular      ","A1  - Pública - Sector Educación                                  ",10,"CAPACHICA","Rural",105.20000000000002]
[352,"PLATERIA","PLATERIA","0501338","I.E.I.  - 257","I.E.I.","Educación Básica Regular      ","A1  - Pública - Sector Educación                                  ",24,"PLATERIA","Urbana",110.2]
[628,"ATUNCOLLA","BUENAVISTA","0515841","I.E.P.   - 70720","I.E.P. ","Educación Básica Regular      ","A1  - Pública - Sector Educación                                  ",46,"ATUNCOLLA","Rural",117.8]
[565,"CAPACHICA","CAPANO","0227504","I.E.P.   - 70015","I.E.P. ","Educación Básica Regular      ","A1  - Pública - Sector Educación                                  ",44,"CAPACHICA","Rural",119.70000000000002]
[779,"CAPACHICA","YAPURA","1023407","I.E.S.  - CORAZON DE CRISTO","I.E.S.","Educación Básica Regular      ","A1  - Pública - Sector Educación                                  ",48,"CAPACHICA","Rural",121.35000000000001]
[737,"MAÑAZO","LARIPATA","0474551","I.E.P.   - 70731","I.E.P. ","Educación Básica Regular      ","A1  - Pública - Sector Educación                                  ",5,"MAÑAZO","Rural",123.89999999999999]
[634,"PICHACANI","SAN JUAN DE DIOS","0547901","I.E.P.   - 70728","I.E.P. ","Educación Básica Regular      ","A1  - Pública - Sector Educación                                  ",6,"PICHACANI","Rural",127.45]
[301,"PAUCARCOLLA","COLLANA","1023803","I.E.I.  - 295","I.E.I.","Educación Básica Regular      ","A1  - Pública - Sector Educación                                  ",25,{"$f":"+B130","v":"PAUCARCOLLA"},"Rural",136.30000000000001]
[802,"ACORA","SACUYO","1025154","I.E.S.  - FRANCISCO BOLOGNESI CERVANTES","I.E.S.","Educación Básica Regular      ","A1  - Pública - Sector Educación                                  ",38,"ACORA","Rural",139.80000000000001]
[748,"COATA","POJSIN","0230417","I.E.P.   - 70031","I.E.P. ","Educación Básica Regular      ","A1  - Pública - Sector Educación                                  ",35,"COATA","Rural",144.05000000000001]
[819,"MAÑAZO","CHARAMAYA","1372861","I.E.S.  - TECNICO AGROPECUARIO CHARAMAYA","I.E.S.","Educación Básica Regular      ","A1  - Pública - Sector Educación                                  ",23,"MAÑAZO","Rural",157.85]
[823,"SAN ANTONIO","CACHIPASCANA","1571439","I.E.S.  - SEÑOR DE HUANCA","I.E.S.","Educación Básica Regular      ","A1  - Pública - Sector Educación                                  ",19,"SAN ANTONIO","Rural",167.29999999999998]
[639,"PICHACANI","HUARIJUYO","0231332","I.E.P.   - 70126","I.E.P. ","Educación Básica Regular      ","A1  - Pública - Sector Educación                                  ",48,"PICHACANI","Rural",178.35]
[735,"MAÑAZO","CHARAMAYA","0226993","I.E.P.   - 70805","I.E.P. ","Educación Básica Regular      ","A1  - Pública - Sector Educación                                  ",37,"MAÑAZO","Rural",190.10000000000002]
[739,"SAN ANTONIO","CACHIPASCANA","0559328","I.E.P.   - 70647","I.E.P. ","Educación Básica Regular      ","A1  - Pública - Sector Educación                                  ",17,"SAN ANTONIO","Rural",190.39999999999998]
[668,"ACORA","TOTORANI","0231118","I.E.P.   - 70104","I.E.P. ","Educación Básica Regular      ","A1  - Pública - Sector Educación                                  ",27,"ACORA","Rural",194.75]
[590,"PUNO","TUNUHUIRICHICO","0230995","I.E.P.   - 70092","I.E.P. ","Educación Básica Regular      ","A1  - Pública - Sector Educación                                  ",31,"PUNO","Rural",198.95000000000002]
[572,"CAPACHICA","ESCALLANI","0230375","I.E.P.   - 70027","I.E.P. ","Educación Básica Regular      ","A1  - Pública - Sector Educación                                  ",52,"CAPACHICA","Rural",226.3]
[646,"PICHACANI","PICHACANI","0231407","I.E.P.   - 70133","I.E.P. ","Educación Básica Regular      ","A1  - Pública - Sector Educación                                  ",25,"PICHACANI","Rural",242.35000000000002]
[143,"ATUNCOLLA","ATUNCOLLA","1023209","I.E.I.  - 293","I.E.I.","Educación Básica Regular      ","A1  - Pública - Sector Educación                                  ",25,"ATUNCOLLA","Urbana",255.95]
[769,"PLATERIA","PLATERIA","0230847","I.E.P.   - 70077","I.E.P. ","Educación Básica Regular      ","A1  - Pública - Sector Educación                                  ",58,"PLATERIA","Urbana",265.45]
[567,"CAPACHICA","YAPURA","0230300","I.E.P.   - 70020","I.E.P. ","Educación Básica Regular      ","A1  - Pública - Sector Educación                                  ",27,"CAPACHICA","Rural",276.65000000000003]
[736,"MAÑAZO","HUILAMOCCO","0529305","I.E.P.   - 70702","I.E.P. ","Educación Básica Regular      ","A1  - Pública - Sector Educación                                  ",20,"MAÑAZO","Rural",277.75]
[741,"SAN ANTONIO","JESUS MARIA","0230672","I.E.P.   - 70059","I.E.P. ","Educación Básica Regular      ","A1  - Pública - Sector Educación                                  ",5,"SAN ANTONIO","Rural",283.05]
[573,"HUATA","QUIVILLACA","0230748","I.E.P.   - 70066","I.E.P. ","Educación Básica Regular      ","A1  - Pública - Sector Educación                                  ",33,"HUATA","Rural",291.3]
[557,"PAUCARCOLLA","COLLANA","0230326","I.E.P.   - 70022","I.E.P. ","Educación Básica Regular      ","A1  - Pública - Sector Educación                                  ",57,"PAUCARCOLLA","Rural",304.15000000000003]
[753,"COATA","COLLANA LOJERA","0230763","I.E.P.   - 70068","I.E.P. ","Educación Básica Regular      ","A1  - Pública - Sector Educación                                  ",40,"COATA","Rural",326.5]
[286,"MAÑAZO","CARI CARI","1470905","I.E.I.  - 1202 QORI SONCCO","I.E.I.","Educación Básica Regular      ","A1  - Pública - Sector Educación                                  ",22,"MAÑAZO","Rural",342.45000000000005]
[654,"ACORA","QUELCA","0230904","I.E.P.   - 70083","I.E.P. ","Educación Básica Regular      ","A1  - Pública - Sector Educación                                  ",58,"ACORA","Rural",349.15]
[785,"CAPACHICA","LLACHON","0578930","I.E.S.  - FRAY SAN MARTIN DE PORRES","I.E.S.","Educación Básica Regular      ","A1  - Pública - Sector Educación                                  ",88,"CAPACHICA","Rural",390.3]
[556,"PAUCARCOLLA","MORO","0239046","I.E.P.   - 70712","I.E.P. ","Educación Básica Regular      ","A1  - Pública - Sector Educación                                  ",93,"PAUCARCOLLA","Rural",417.95000000000005]
[637,"PICHACANI","HUACOCHULLO","0231571","I.E.P.   - 70150","I.E.P. ","Educación Básica Regular      ","A1  - Pública - Sector Educación                                  ",37,"PICHACANI","Rural",447.95000000000005]
[232,"COATA","CANDILE","1556299","I.E.I.  - 1222 RAYITO DE SOL CANDILE","I.E.I.","Educación Básica Regular      ","A1  - Pública - Sector Educación                                  ",10,"COATA","Rural",454.9]
[562,"CAPACHICA","LLACHON","0230490","I.E.P.   - 70039","I.E.P. ","Educación Básica Regular      ","A1  - Pública - Sector Educación                                  ",70,"CAPACHICA","Rural",465.29999999999995]
[563,"CAPACHICA","SIALE","0230276","I.E.P.   - 70017","I.E.P. ","Educación Básica Regular      ","A1  - Pública - Sector Educación                                  ",18,"CAPACHICA","Rural",535.19999999999993]
[751,"COATA","SORAZA","0230441","I.E.P.   - 70034 NUESTRA SEÑORA DE LA MERCED","I.E.P. ","Educación Básica Regular      ","A1  - Pública - Sector Educación                                  ",52,"COATA","Rural",563.55000000000007]
[789,"ACORA","ANCCACCA","0660282","I.E.S.  - SIMON BOLIVAR","I.E.S.","Educación Básica Regular      ","A1  - Pública - Sector Educación                                  ",52,"ACORA","Rural",570.30000000000007]
[780,"CAPACHICA","ESCALLANI","1023365","I.E.S.  - JOSE OLAYA BALANDRA","I.E.S.","Educación Básica Regular      ","A1  - Pública - Sector Educación                                  ",58,"CAPACHICA","Rural",608.44999999999993]
[570,"CAPACHICA","CHAPA","0230383","I.E.P.   - 70028","I.E.P. ","Educación Básica Regular      ","A1  - Pública - Sector Educación                                  ",65,"CAPACHICA","Rural",612.45000000000005]
[630,"ATUNCOLLA","PALCAMAYO","0230524","I.E.P.   - 70042","I.E.P. ","Educación Básica Regular      ","A1  - Pública - Sector Educación                                  ",61,"ATUNCOLLA","Rural",619.65]
[633,"ATUNCOLLA","SAN JOSE PRINCIPIO","0227017","I.E.P.   - 70713","I.E.P. ","Educación Básica Regular      ","A1  - Pública - Sector Educación                                  ",48,"ATUNCOLLA","Urbana",623.25]
[849,"PICHACANI","HUARIJUYO","1025816","I.E.S.  - MIGUEL GRAU","I.E.S.","Educación Básica Regular      ","A1  - Pública - Sector Educación                                  ",51,"PICHACANI","Rural",658.69999999999993]
[718,"CHUCUITO","MIRAFLORES","0230839","I.E.P.   - 70076","I.E.P. ","Educación Básica Regular      ","A1  - Pública - Sector Educación                                  ",108,"CHUCUITO","Urbana",659.25]
[568,"CAPACHICA","CCOTOS","0230268","I.E.P.   - 70016","I.E.P. ","Educación Básica Regular      ","A1  - Pública - Sector Educación                                  ",66,"CAPACHICA","Rural",682.75]
[566,"CAPACHICA","CAPACHICA","0230466","I.E.P.   - 70036","I.E.P. ","Educación Básica Regular      ","A1  - Pública - Sector Educación                                  ",134,"CAPACHICA","Urbana",716.84999999999991]
[682,"ACORA","ACORA","0230854","I.E.P.   - 70078","I.E.P. ","Educación Básica Regular      ","A1  - Pública - Sector Educación                                  ",238,"ACORA","Urbana",748.05000000000007]
[691,"ACORA","ACORA","0230821","I.E.P.   - 70075","I.E.P. ","Educación Básica Regular      ","A1  - Pública - Sector Educación                                  ",216,"ACORA","Urbana",794.35]
[790,"ACORA","TOTORANI","0535864","I.E.S.  - RICARDO PALMA","I.E.S.","Educación Básica Regular      ","A1  - Pública - Sector Educación                                  ",141,"ACORA","Rural",825.89999999999986]
[632,"ATUNCOLLA","ATUNCOLLA","0230193","I.E.P.   - 70009 VIRGEN DEL CARMEN","I.E.P. ","Educación Básica Regular      ","A1  - Pública - Sector Educación                                  ",191,"ATUNCOLLA","Urbana",970.15]
[754,"COATA","COATA","0230409","I.E.P.   - 70030","I.E.P. ","Educación Básica Regular      ","A1  - Pública - Sector Educación                                  ",146,"COATA","Urbana",989.59999999999991]
[732,"MAÑAZO","CARI CARI","0230540","I.E.P.   - 70044","I.E.P. ","Educación Básica Regular      ","A1  - Pública - Sector Educación                                  ",100,"MAÑAZO","Rural",994.85]
[859,"PLATERIA","PLATERIA","0474510","I.E.S.  - MANUEL Z. CAMACHO","I.E.S.","Educación Básica Regular      ","A1  - Pública - Sector Educación                                  ",97,"PLATERIA","Urbana",1059.8000000000002]
[855,"COATA","SORAZA","0578963","I.E.S.  - SORAZA","I.E.S.","Educación Básica Regular      ","A1  - Pública - Sector Educación                                  ",75,"COATA","Rural",1166.5]
[811,"CHUCUITO","CHUCUITO","0240358","I.E.S.  - EMILIO ROMERO PADILLA","I.E.S.","Educación Básica Regular      ","A1  - Pública - Sector Educación                                  ",155,"CHUCUITO","Urbana",1186.25]
[580,"VILQUE","VILQUE","0230508","I.E.P.   - 70040","I.E.P. ","Educación Básica Regular      ","A1  - Pública - Sector Educación                                  ",159,"VILQUE","Urbana",1227.7]
[821,"MAÑAZO","CARI CARI","1571470","I.E.S.  - SAN MIGUEL","I.E.S.","Educación Básica Regular      ","A1  - Pública - Sector Educación                                  ",132,"MAÑAZO","Rural",1256.9499999999998]
[559,"PAUCARCOLLA","PAUCARCOLLA","0230169","I.E.P.   - 70006","I.E.P. ","Educación Básica Regular      ","A1  - Pública - Sector Educación                                  ",139,"PAUCARCOLLA","Urbana",1275.1499999999996]
[638,"PICHACANI","LARAQUERI","0230987","I.E.P.   - 70091","I.E.P. ","Educación Básica Regular      ","A1  - Pública - Sector Educación                                  ",201,"PICHACANI","Urbana",1340.45]
[577,"HUATA","HUATTA","0230482","I.E.P.   - 70038","I.E.P. ","Educación Básica Regular      ","A1  - Pública - Sector Educación                                  ",198,"HUATA","Urbana",1361.35]
[781,"CAPACHICA","CCOTOS","1154491","I.E.S.  - JOSE ABELARDO QUIÑONES","I.E.S.","Educación Básica Regular      ","A1  - Pública - Sector Educación                                  ",53,"CAPACHICA","Rural",1388.3999999999999]
[846,"ATUNCOLLA","ATUNCOLLA","0507533","I.E.S.  - SAN ANDRES","I.E.S.","Educación Básica Regular      ","A1  - Pública - Sector Educación                                  ",275,"ATUNCOLLA","Urbana",1653.75]
[854,"COATA","COATA","0578955","I.E.S.  - SAN AGUSTIN","I.E.S.","Educación Básica Regular      ","A1  - Pública - Sector Educación                                  ",302,"COATA","Urbana",1680.0500000000002]
[783,"CAPACHICA","CHAPA","0239723","I.E.S.  - ENRIQUE TORRES BELON","I.E.S.","Educación Básica Regular      ","A1  - Pública - Sector Educación                                  ",114,"CAPACHICA","Rural",1844.5000000000002]
[853,"COATA","SUCASCO","1023688","I.E.S.  - TECNICO INDUSTRIAL TAHUANTINSUYO","I.E.S.","Educación Básica Regular      ","A1  - Pública - Sector Educación                                  ",203,"COATA","Urbana",1953.4499999999998]
[575,"HUATA","YASIN","0230433","I.E.P.   - 70033 SEÑOR DE HUANCA","I.E.P. ","Educación Básica Regular      ","A1  - Pública - Sector Educación                                  ",46,"HUATA","Rural",2104.15]
[848,"PICHACANI","PICHACANI","1023928","I.E.S.  - MARISCAL SUCRE","I.E.S.","Educación Básica Regular      ","A1  - Pública - Sector Educación                                  ",37,"PICHACANI","Rural",2213.8000000000002]
[733,"MAÑAZO","MAÑAZO","0230219","I.E.P.   - 70011","I.E.P. ","Educación Básica Regular      ","A1  - Pública - Sector Educación                                  ",361,"MAÑAZO","Urbana",2542.25]
[787,"HUATA","HUATTA","0522193","I.E.S.  - SAN JUAN","I.E.S.","Educación Básica Regular      ","A1  - Pública - Sector Educación                                  ",244,"HUATA","Urbana",2771.2]
[777,"PAUCARCOLLA","PAUCARCOLLA","0522292","I.E.S.  - TUPAC AMARU","I.E.S.","Educación Básica Regular      ","A1  - Pública - Sector Educación                                  ",158,"PAUCARCOLLA","Urbana",3273.65]
[847,"PICHACANI","LARAQUERI","0489963","I.E.S.  - EDUARDO BENIGNO LUQUE ROMERO","I.E.S.","Educación Básica Regular      ","A1  - Pública - Sector Educación                                  ",312,"PICHACANI","Urbana",3631.3499999999995]
[784,"CAPACHICA","CAPACHICA","0474452","I.E.S.  - JOSE CARLOS MARIATEGUI","I.E.S.","Educación Básica Regular      ","A1  - Pública - Sector Educación                                  ",240,"CAPACHICA","Urbana",3946.8499999999995]
[788,"VILQUE","VILQUE","0631333","I.E.S.  - JUAN BUSTAMANTE DUEÑAS","I.E.S.","Educación Básica Regular      ","A1  - Pública - Sector Educación                                  ",164,{"$f":"+B194","v":"VILQUE"},"Urbana",4198.95]
[820,"MAÑAZO","ALTO ALIANZA","0474569","I.E.S.  - MAÑAZO","I.E.S.","Educación Básica Regular      ","A1  - Pública - Sector Educación                                  ",288,"MAÑAZO","Urbana",4735.5]
[796,"ACORA","ACORA","0240341","I.E.S.  - ALFONSO TORRES LUNA","I.E.S.","Educación Básica Regular      ","A1  - Pública - Sector Educación                                  ",421,"ACORA","Urbana",5555]
[814,"CHUCUITO","COCHIRAYA","1023480","I.E.S.  - INDEPENDENCIA NACIONAL","I.E.S.","Educación Básica Regular      ","A1  - Pública - Sector Educación                                  ",48,"CHUCUITO","Rural",6699.6]
[1,"ACORA","CUCHO ESQUEÑA","2138739","I.E.N.  - CUCHO ESQUEÑA","I.E.N.","Educación Básica Regular      ","A1  - Pública - Sector Educación                                  ",7,"ACORA","Rural"]
[2,"ACORA","CULTA","2138737","I.E.N.  - CULTA PILCUYO","I.E.N.","Educación Básica Regular      ","A1  - Pública - Sector Educación                                  ",6,"ACORA","Rural"]
[3,"ACORA","ACORA","2138713","I.E.N.  - VICTORIA","I.E.N.","Educación Básica Regular      ","A1  - Pública - Sector Educación                                  ",12,"ACORA","Urbana"]
[4,"ACORA","SANTA ROSA DE YANAQUE","2138724","I.E.N.  - SILLUYAMAYA","I.E.N.","Educación Básica Regular      ","A1  - Pública - Sector Educación                                  ",8,"ACORA","Rural"]
[5,"ACORA","CHILLEROTA","2138732","I.E.N.  - CHILLEROTA","I.E.N.","Educación Básica Regular      ","A1  - Pública - Sector Educación                                  ",6,"ACORA","Rural"]
[6,"ACORA","JAYU JAYU","2130001","I.E.N.  - JAYU JAYU RINCONADA","I.E.N.","Educación Básica Regular      ","A1  - Pública - Sector Educación                                  ",3,"ACORA","Urbana"]
[7,"ACORA","YANAPATA","2130008","I.E.N.  - YANAPATA","I.E.N.","Educación Básica Regular      ","A1  - Pública - Sector Educación                                  ",4,"ACORA","Rural"]
[8,"ACORA","HUILASIPE CALAPUJO","2130009","I.E.N.  - HUILASIPE CALAPUJO","I.E.N.","Educación Básica Regular      ","A1  - Pública - Sector Educación                                  ",3,"ACORA","Rural"]
[9,"ACORA","VILLA SOCCA","2043226","I.E.N.  - HUALLATANI","I.E.N.","Educación Básica Regular      ","A1  - Pública - Sector Educación                                  ",10,"ACORA","Rural"]
[10,"ACORA","CARITAMAYA","2062923","I.E.N.  - CARITAMAYA B","I.E.N.","Educación Básica Regular      ","A1  - Pública - Sector Educación                                  ",8,"ACORA","Urbana"]
[11,"ACORA","PUTINI","2062924","I.E.N.  - PUTINI","I.E.N.","Educación Básica Regular      ","A1  - Pública - Sector Educación                                  ",5,"ACORA","Rural"]
[12,"ACORA","MARCA ESQUEÑA","2063008","I.E.N.  - MARCA ESQUEÑA","I.E.N.","Educación Básica Regular      ","A1  - Pública - Sector Educación                                  ",3,"ACORA","Rural"]
[13,"ACORA","HUATACHI CHILA","2066304","I.E.N.  - HUANTACACHI","I.E.N.","Educación Básica Regular      ","A1  - Pública - Sector Educación                                  ",5,"ACORA","Rural"]
[14,"ACORA","MOCARAYA","2057907","I.E.N.  - MOCARAYA","I.E.N.","Educación Básica Regular      ","A1  - Pública - Sector Educación                                  ",9,"ACORA","Rural"]
[15,"ACORA","CHAMCHILLA","2058007","I.E.N.  - CUCHO CHAMCHILLA","I.E.N.","Educación Básica Regular      ","A1  - Pública - Sector Educación                                  ",7,"ACORA","Rural"]
[16,"ACORA","KALLANCA","2058011","I.E.N.  - KALLANCA","I.E.N.","Educación Básica Regular      ","A1  - Pública - Sector Educación                                  ",10,"ACORA","Rural"]
[17,"ACORA","ACORA","2058016","I.E.N.  - TUPAC AMARU","I.E.N.","Educación Básica Regular      ","A1  - Pública - Sector Educación                                  ",13,"ACORA","Urbana"]
[18,"ACORA","AMPARANI","2058017","I.E.N.  - AMPARANI","I.E.N.","Educación Básica Regular      ","A1  - Pública - Sector Educación                                  ",2,"ACORA","Rural"]
[19,"ACORA","AMPARANI","2058019","I.E.N.  - AYMAHUI QUENARIRI","I.E.N.","Educación Básica Regular      ","A1  - Pública - Sector Educación                                  ",9,"ACORA","Rural"]
[20,"ACORA","PARCCOCCOTA","2058020","I.E.N.  - HUATA ESQUINA","I.E.N.","Educación Básica Regular      ","A1  - Pública - Sector Educación                                  ",14,"ACORA","Rural"]
[21,"ACORA","JAYU JAYU","2058021","I.E.N.  - INKATAKI","I.E.N.","Educación Básica Regular      ","A1  - Pública - Sector Educación                                  ",3,"ACORA","Urbana"]
[22,"ACORA","ACORA","2059501","I.E.N.  - SAN PEDRO","I.E.N.","Educación Básica Regular      ","A1  - Pública - Sector Educación                                  ",8,"ACORA","Urbana"]
[23,"ACORA","BARRIO SAN MARTIN","2059502","I.E.N.  - SAN MARTIN","I.E.N.","Educación Básica Regular      ","A1  - Pública - Sector Educación                                  ",8,"ACORA","Urbana"]
[24,"ACORA","BARRIO MIRAFLORES","2059503","I.E.N.  - MIRAFLORES A","I.E.N.","Educación Básica Regular      ","A1  - Pública - Sector Educación                                  ",8,"ACORA","Urbana"]
[25,"ACORA","ACORA","2059511","I.E.N.  - CAPULLITOS","I.E.N.","Educación Básica Regular      ","A1  - Pública - Sector Educación                                  ",6,"ACORA","Urbana"]
[26,"ACORA","BARRIO SAN JUAN","2059514","I.E.N.  - SAN JUAN","I.E.N.","Educación Básica Regular      ","A1  - Pública - Sector Educación                                  ",11,"ACORA","Urbana"]
[27,"ACORA","ACORA","2059516","I.E.N.  - RETOÑITOS","I.E.N.","Educación Básica Regular      ","A1  - Pública - Sector Educación                                  ",7,"ACORA","Urbana"]
[28,"ACORA","ACORA","2059518","I.E.N.  - SANGRE AYMARA","I.E.N.","Educación Básica Regular      ","A1  - Pública - Sector Educación                                  ",9,"ACORA","Urbana"]
[29,"ACORA","PARCCOCCOTA","2059522","I.E.N.  - PARCCOCCOTA","I.E.N.","Educación Básica Regular      ","A1  - Pública - Sector Educación                                  ",6,"ACORA","Rural"]
[30,"ACORA","CAPALLA","2059524","I.E.N.  - CAPALLA","I.E.N.","Educación Básica Regular      ","A1  - Pública - Sector Educación                                  ",4,"ACORA","Urbana"]
[31,"ACORA","VILLA SOCCA","2060605","I.E.N.  - SOCCA PATJA","I.E.N.","Educación Básica Regular      ","A1  - Pública - Sector Educación                                  ",11,"ACORA","Rural"]
[32,"ACORA","CARITAMAYA","2060609","I.E.N.  - TITIJO","I.E.N.","Educación Básica Regular      ","A1  - Pública - Sector Educación                                  ",4,"ACORA","Urbana"]
[33,"ACORA","COLLINI","2060611","I.E.N.  - HUILALACA","I.E.N.","Educación Básica Regular      ","A1  - Pública - Sector Educación                                  ",5,"ACORA","Rural"]
[34,"ACORA","CENTRAL PUKARA","2060613","I.E.N.  - CENTRAL PUKARA","I.E.N.","Educación Básica Regular      ","A1  - Pública - Sector Educación                                  ",4,"ACORA","Rural"]
[35,"ACORA","MOLINO","2060616","I.E.N.  - MOLINO","I.E.N.","Educación Básica Regular      ","A1  - Pública - Sector Educación                                  ",5,"ACORA","Rural"]
[36,"ACORA","SAN JOSE DE CALALA","2060617","I.E.N.  - SAN JOSE DE CALALA","I.E.N.","Educación Básica Regular      ","A1  - Pública - Sector Educación                                  ",8,"ACORA","Rural"]
[37,"ACORA","SAN CARLOS","2060618","I.E.N.  - SAN CARLOS","I.E.N.","Educación Básica Regular      ","A1  - Pública - Sector Educación                                  ",4,"ACORA","Rural"]
[38,"ACORA","YUNGUYO CHAMACUTA","2060621","I.E.N.  - YUNGUYO CHAMACUTA","I.E.N.","Educación Básica Regular      ","A1  - Pública - Sector Educación                                  ",10,"ACORA","Rural"]
[39,"ACORA","CCOTA CCOTA","2060628","I.E.N.  - CCOTA CCOTA","I.E.N.","Educación Básica Regular      ","A1  - Pública - Sector Educación                                  ",10,"ACORA","Urbana"]
[40,"ACORA","CHANCACHI","2060629","I.E.N.  - CHANCACHI CENTRAL","I.E.N.","Educación Básica Regular      ","A1  - Pública - Sector Educación                                  ",6,"ACORA","Rural"]
[41,"ACORA","ANOCARIRE","2061407","I.E.N.  - ANOCARIRI","I.E.N.","Educación Básica Regular      ","A1  - Pública - Sector Educación                                  ",4,"ACORA","Rural"]
[42,"ACORA","MARQUIRE","2061408","I.E.N.  - MARQUIRE","I.E.N.","Educación Básica Regular      ","A1  - Pública - Sector Educación                                  ",7,"ACORA","Rural"]
[43,"ACORA","HUANTACACHI CHILA","2061409","I.E.N.  - HUANTACACHI","I.E.N.","Educación Básica Regular      ","A1  - Pública - Sector Educación                                  ",8,"ACORA","Rural"]
[44,"ACORA","JURUHUANANI","2061416","I.E.N.  - JURUHUANANI","I.E.N.","Educación Básica Regular      ","A1  - Pública - Sector Educación                                  ",6,"ACORA","Rural"]
[45,"ACORA","KENACO","2061417","I.E.N.  - KENACO","I.E.N.","Educación Básica Regular      ","A1  - Pública - Sector Educación                                  ",5,"ACORA","Rural"]
[46,"ACORA","MOLLOCO","2062907","I.E.N.  - MOLLOCO A","I.E.N.","Educación Básica Regular      ","A1  - Pública - Sector Educación                                  ",8,"ACORA","Rural"]
[47,"ACORA","MOLLOCO","2062910","I.E.N.  - MOLLOCO B","I.E.N.","Educación Básica Regular      ","A1  - Pública - Sector Educación                                  ",7,"ACORA","Rural"]
[48,"ACORA","CARITAMAYA","2062912","I.E.N.  - CARITAMAYA A","I.E.N.","Educación Básica Regular      ","A1  - Pública - Sector Educación                                  ",12,"ACORA","Urbana"]
[49,"ACORA","CCACCA","2062915","I.E.N.  - CCACCA","I.E.N.","Educación Básica Regular      ","A1  - Pública - Sector Educación                                  ",8,"ACORA","Rural"]
[50,"ACORA","JAYU JAYU","2062918","I.E.N.  - INTI JALLSU","I.E.N.","Educación Básica Regular      ","A1  - Pública - Sector Educación                                  ",1,"ACORA","Urbana"]
[51,"ACORA","JAYU JAYU","2062919","I.E.N.  - JARIHUATA CCALASANI","I.E.N.","Educación Básica Regular      ","A1  - Pública - Sector Educación                                  ",5,"ACORA","Urbana"]
[52,"ACORA","ISCATA","1710664","I.E.I.  - 70158","I.E.I.","Educación Básica Regular      ","A1  - Pública - Sector Educación                                  ",17,"ACORA","Rural"]
[53,"ACORA","ISCACHURO","1710672","I.E.I.  - 70085","I.E.I.","Educación Básica Regular      ","A1  - Pública - Sector Educación                                  ",7,"ACORA","Rural"]
[54,"ACORA","CCACCA","1746254","I.E.I.  - CCACCA","I.E.I.","Educación Básica Regular      ","A1  - Pública - Sector Educación                                  ",13,"ACORA","Rural"]
[55,"ACORA","TOTORANI","1621176","I.E.I.  - 1237 VIRGEN DEL ROSARIO","I.E.I.","Educación Básica Regular      ","A1  - Pública - Sector Educación                                  ",13,"ACORA","Rural"]
[56,"ACORA","PIRCO","1621184","I.E.I.  - 1238","I.E.I.","Educación Básica Regular      ","A1  - Pública - Sector Educación                                  ",5,"ACORA","Rural"]
[57,"ACORA","COLLINI","1621218","I.E.I.  - 1241 DIVINA MISERICORDIA","I.E.I.","Educación Básica Regular      ","A1  - Pública - Sector Educación                                  ",16,"ACORA","Rural"]
[58,"ACORA","THUNCO","1621291","I.E.I.  - 1249 SAN ANTONIO DE THUNCO","I.E.I.","Educación Básica Regular      ","A1  - Pública - Sector Educación                                  ",16,"ACORA","Rural"]
[59,"ACORA","AMPARANI","1621358","I.E.I.  - 1255 SANTA TERESITA DEL NIÑO JESUS","I.E.I.","Educación Básica Regular      ","A1  - Pública - Sector Educación                                  ",14,"ACORA","Rural"]
[60,"ACORA","CCACCALLACA","1623628","I.E.I.  - 1291 CORAZON DE JESUS","I.E.I.","Educación Básica Regular      ","A1  - Pública - Sector Educación                                  ",10,"ACORA","Rural"]
[61,"ACORA","TUNQUIPA","1621648","I.E.I.  - 1282 LOS AMIGUITOS DE CORAZON DE JESUS","I.E.I.","Educación Básica Regular      ","A1  - Pública - Sector Educación                                  ",6,{"$f":"+B258","v":"ACORA"},"Rural"]
[62,"ACORA","HUARCANTINQUIHUI","1621655","I.E.I.  - 1283 SEÑOR DE HUANCA","I.E.I.","Educación Básica Regular      ","A1  - Pública - Sector Educación                                  ",7,"ACORA","Rural"]
[63,"ACORA","IMATA","1621663","I.E.I.  - 1284 MARIA MONTESSORI","I.E.I.","Educación Básica Regular      ","A1  - Pública - Sector Educación                                  ",5,"ACORA","Rural"]
[64,"ACORA","JACHACACHI","1621671","I.E.I.  - 1285 NIÑO JESUS DE JACHACACHI","I.E.I.","Educación Básica Regular      ","A1  - Pública - Sector Educación                                  ",6,"ACORA","Rural"]
[65,"ACORA","CHAJANA","1621382","I.E.I.  - 1258 EMILIA BARCIA BONIFFATTI","I.E.I.","Educación Básica Regular      ","A1  - Pública - Sector Educación                                  ",9,"ACORA","Rural"]
[66,"ACORA","AGUAS CALIENTES","1621408","I.E.I.  - 1260 AGUAS CALIENTES","I.E.I.","Educación Básica Regular      ","A1  - Pública - Sector Educación                                  ",7,"ACORA","Rural"]
[67,"ACORA","PARAPICHUZA","1621523","I.E.I.  - 1272 PASITOS MAGICOS","I.E.I.","Educación Básica Regular      ","A1  - Pública - Sector Educación                                  ",6,"ACORA","Rural"]
[68,"ACORA","QUENAFAJA","1655042","I.E.I.  - 1307 SEMILLITAS DEL MAÑANA","I.E.I.","Educación Básica Regular      ","A1  - Pública - Sector Educación                                  ",7,"ACORA","Rural"]
[69,"ACORA","COCOSANI","1654946","I.E.I.  - 1297 VIRGENCITA DE LA ASUNCION","I.E.I.","Educación Básica Regular      ","A1  - Pública - Sector Educación                                  ",8,"ACORA","Rural"]
[70,"ACORA","CCOPAMAYA","1654953","I.E.I.  - 1298 CAPULLITOS DE CANTUTA","I.E.I.","Educación Básica Regular      ","A1  - Pública - Sector Educación                                  ",9,"ACORA","Rural"]
[71,"ACORA","ISCAHUINCHOCA","1654961","I.E.I.  - 1299 LOS ANGELITOS","I.E.I.","Educación Básica Regular      ","A1  - Pública - Sector Educación                                  ",12,"ACORA","Rural"]
[72,"ACORA","CIUDAD NUEVA","1662394","I.E.I.  - 1308","I.E.I.","Educación Básica Regular      ","A1  - Pública - Sector Educación                                  ",12,"ACORA","Urbana"]
[73,"ACORA","HUAÑASCURO","1679323","I.E.I.  - HUAÑUSCURO","I.E.I.","Educación Básica Regular      ","A1  - Pública - Sector Educación                                  ",12,"ACORA","Rural"]
[74,"ACORA","CAPALLA","1569698","I.E.I.  - 1229 LOS PEQUEÑOS GENIOS","I.E.I.","Educación Básica Regular      ","A1  - Pública - Sector Educación                                  ",4,"ACORA","Urbana"]
[75,"ACORA","QUELCA","1569714","I.E.I.  - 1212","I.E.I.","Educación Básica Regular      ","A1  - Pública - Sector Educación                                  ",9,"ACORA","Rural"]
[76,"ACORA","SANTA ROSA DE YANAQUE","1569722","I.E.I.  - 1230 SANTA ROSA","I.E.I.","Educación Básica Regular      ","A1  - Pública - Sector Educación                                  ",4,"ACORA","Rural"]
[77,"ACORA","THUNUHUAYA","1556463","I.E.I.  - 1206","I.E.I.","Educación Básica Regular      ","A1  - Pública - Sector Educación                                  ",13,"ACORA","Rural"]
[78,"ACORA","CARITAMAYA","1556307","I.E.I.  - 1216 SAN SANTIAGO DE CARITAMAYA","I.E.I.","Educación Básica Regular      ","A1  - Pública - Sector Educación                                  ",15,"ACORA","Urbana"]
[79,"ACORA","CUCHO ESQUEÑA","1556331","I.E.I.  - 1214 MI DIVINO NIÑO","I.E.I.","Educación Básica Regular      ","A1  - Pública - Sector Educación                                  ",12,"ACORA","Rural"]
[80,"ACORA","JACHA HUINCHOCA","1556349","I.E.I.  - 1217 ARCO IRIS DE LA SABIDURIA","I.E.I.","Educación Básica Regular      ","A1  - Pública - Sector Educación                                  ",12,"ACORA","Rural"]
[81,"ACORA","MOLLOCO","1556380","I.E.I.  - 1213 RAYITOS DE LUZ","I.E.I.","Educación Básica Regular      ","A1  - Pública - Sector Educación                                  ",11,"ACORA","Rural"]
[82,"ACORA","CHUSAMARCA","3870430","I.E.N.  - CHUSAMARCA","I.E.N.","Educación Básica Regular      ","A1  - Pública - Sector Educación                                  ",7,"ACORA","Rural"]
[83,"ACORA","SILLUNI HAMAYA","3870431","I.E.N.  - SILLUNAMAYA","I.E.N.","Educación Básica Regular      ","A1  - Pública - Sector Educación                                  ",8,"ACORA","Rural"]
[84,"ACORA","YUNGUYO CHAMACUTA","3870432","I.E.N.  - YUNGUYO CHAMACUTA","I.E.N.","Educación Básica Regular      ","A1  - Pública - Sector Educación                                  ",10,"ACORA","Rural"]
[85,"ACORA","ACORA","3870434","I.E.N.  - 2 DE MAYO","I.E.N.","Educación Básica Regular      ","A1  - Pública - Sector Educación                                  ",9,"ACORA","Urbana"]
[86,"ACORA","HUILACAYA","3870435","I.E.N.  - HUILACAYA","I.E.N.","Educación Básica Regular      ","A1  - Pública - Sector Educación                                  ",8,"ACORA","Rural"]
[87,"ACORA","AYMAHUI QUENARIRE","3870436","I.E.N.  - HUYLAMAYA","I.E.N.","Educación Básica Regular      ","A1  - Pública - Sector Educación                                  ",9,"ACORA","Rural"]
[88,"ACORA","JAYU JAYU","3870437","I.E.N.  - HUARICONSE","I.E.N.","Educación Básica Regular      ","A1  - Pública - Sector Educación                                  ",4,"ACORA","Urbana"]
[89,"ACORA","CUSINI","3922314","I.E.N.  - CUSINI","I.E.N.","Educación Básica Regular      ","A1  - Pública - Sector Educación                                  ",9,"ACORA","Rural"]
[90,"ACORA","QUELCA SECTOR MIRAFLORES","3922315","I.E.N.  - QUELKA","I.E.N.","Educación Básica Regular      ","A1  - Pública - Sector Educación                                  ",5,"ACORA","Rural"]
[91,"ACORA","TOTORANI","3916593","I.E.N.  - CASITA MAGICA","I.E.N.","Educación Básica Regular      ","A1  - Pública - Sector Educación                                  ",8,"ACORA","Rural"]
[92,"ACORA","ANCCACCA","3916589","I.E.N.  - WIÑAY PACHA WAWA","I.E.N.","Educación Básica Regular      ","A1  - Pública - Sector Educación                                  ",4,"ACORA","Rural"]
[93,"ACORA","AMPARANI","3916584","I.E.N.  - NUEVA ESPERANZA","I.E.N.","Educación Básica Regular      ","A1  - Pública - Sector Educación                                  ",7,"ACORA","Rural"]
[94,"ACORA","SOCCA","0539254","I.E.I.  - 258","I.E.I.","Educación Básica Regular      ","A1  - Pública - Sector Educación                                  ",27,"ACORA","Rural"]
[97,"ACORA","JAYU JAYU","0799437","I.E.I.  - 312","I.E.I.","Educación Básica Regular      ","A1  - Pública - Sector Educación                                  ",8,"ACORA","Urbana"]
[98,"ACORA","CHALLOCOLLO","1470913","I.E.I.  - 1195 NUEVO PARAISO","I.E.I.","Educación Básica Regular      ","A1  - Pública - Sector Educación                                  ",9,"ACORA","Urbana"]
[99,"ACORA","CULTA","1470939","I.E.I.  - 1193","I.E.I.","Educación Básica Regular      ","A1  - Pública - Sector Educación                                  ",20,"ACORA","Rural"]
[100,"ACORA","CUSINI","1470947","I.E.I.  - 1198 NIÑO JESUS DE PRAGA","I.E.I.","Educación Básica Regular      ","A1  - Pública - Sector Educación                                  ",7,"ACORA","Rural"]
[101,"ACORA","CHANCACHI","1470962","I.E.I.  - 1189 LA MERCED","I.E.I.","Educación Básica Regular      ","A1  - Pública - Sector Educación                                  ",12,"ACORA","Rural"]
[102,"ACORA","AYRUMAS CARUMAS","1470871","I.E.I.  - 1194 JEAN PIAGET","I.E.I.","Educación Básica Regular      ","A1  - Pública - Sector Educación                                  ",14,"ACORA","Rural"]
[103,"ACORA","JILATAMARCA","1414721","I.E.I.  - 396","I.E.I.","Educación Básica Regular      ","A1  - Pública - Sector Educación                                  ",6,"ACORA","Rural"]
[104,"AMANTANI","HUAILLANOPAMPA","3884998","I.E.N.  - HUAYLLANO","I.E.N.","Educación Básica Regular      ","A1  - Pública - Sector Educación                                  ",2,"AMANTANI","Rural"]
[105,"AMANTANI","INCATIANA","1621531","I.E.I.  - 1273 SEMILLITAS DE ESPERANZA","I.E.I.","Educación Básica Regular      ","A1  - Pública - Sector Educación                                  ",10,"AMANTANI","Rural"]
[106,"AMANTANI","VILLA ORINOJON","1621481","I.E.I.  - 1268 KANTUTAS DE VILLA","I.E.I.","Educación Básica Regular      ","A1  - Pública - Sector Educación                                  ",4,"AMANTANI","Rural"]
[107,"AMANTANI","SAN CAYANO / SANCAYUNE","1621317","I.E.I.  - 1251 LUZ DEL SABER","I.E.I.","Educación Básica Regular      ","A1  - Pública - Sector Educación                                  ",9,"AMANTANI","Rural"]
[108,"AMANTANI","OCCOSUYO","1621192","I.E.I.  - 1239 DIVINO NIÑO","I.E.I.","Educación Básica Regular      ","A1  - Pública - Sector Educación                                  ",8,"AMANTANI","Rural"]
[109,"AMANTANI","COLQUECACHI","2044001","I.E.N.  - COLQUECACHI","I.E.N.","Educación Básica Regular      ","A1  - Pública - Sector Educación                                  ",5,"AMANTANI","Rural"]
[110,"AMANTANI","ALTO SANCAYUNI","2044007","I.E.N.  - ALTO SANCAYUNI","I.E.N.","Educación Básica Regular      ","A1  - Pública - Sector Educación                                  ",7,"AMANTANI","Rural"]
[111,"AMANTANI","OCCOPAMPA","2044009","I.E.N.  - OCCOPAMPA","I.E.N.","Educación Básica Regular      ","A1  - Pública - Sector Educación                                  ",7,"AMANTANI","Rural"]
[112,"AMANTANI","SANCAYUNI","2044015","I.E.N.  - TOQOSI","I.E.N.","Educación Básica Regular      ","A1  - Pública - Sector Educación                                  ",2,"AMANTANI","Rural"]
[113,"AMANTANI","AMANTANI","2044701","I.E.N.  - LAMPAYUNI","I.E.N.","Educación Básica Regular      ","A1  - Pública - Sector Educación                                  ",3,"AMANTANI","Urbana"]
[114,"AMANTANI","ESTANCIA TAQUILE","2044702","I.E.N.  - ESTANCIA TAQUILE","I.E.N.","Educación Básica Regular      ","A1  - Pública - Sector Educación                                  ",10,"AMANTANI","Rural"]
[115,"AMANTANI","SANTA ROSA","2044707","I.E.N.  - SALTANAHUAYCCO","I.E.N.","Educación Básica Regular      ","A1  - Pública - Sector Educación                                  ",5,"AMANTANI","Rural"]
[116,"AMANTANI","INCATIANA","2044708","I.E.N.  - INCA SAMANA","I.E.N.","Educación Básica Regular      ","A1  - Pública - Sector Educación                                  ",5,"AMANTANI","Rural"]
[117,"AMANTANI","AMANTANI","1470954","I.E.I.  - 1197 SOR ANA DE LOS ANGELES","I.E.I.","Educación Básica Regular      ","A1  - Pública - Sector Educación                                  ",9,"AMANTANI","Urbana"]
[118,"AMANTANI","AMANTANI","1470996","I.E.I.  - 1196 LOS ANGELES DE SANTA ROSA","I.E.I.","Educación Básica Regular      ","A1  - Pública - Sector Educación                                  ",9,"AMANTANI","Urbana"]
[119,"AMANTANI","TAQUILE","1025352","I.E.I.  - 291","I.E.I.","Educación Básica Regular      ","A1  - Pública - Sector Educación                                  ",52,"AMANTANI","Rural"]
[120,"ATUNCOLLA","YANAMOCCO","2051503","I.E.N.  - YANAMOCCO","I.E.N.","Educación Básica Regular      ","A1  - Pública - Sector Educación                                  ",8,"ATUNCOLLA","Rural"]
[121,"ATUNCOLLA","TICANI PAMPA","2051504","I.E.N.  - TICANI PAMPA","I.E.N.","Educación Básica Regular      ","A1  - Pública - Sector Educación                                  ",4,"ATUNCOLLA","Rural"]
[122,"ATUNCOLLA","LLULLUCHANI","2051505","I.E.N.  - LLULLUCHANI","I.E.N.","Educación Básica Regular      ","A1  - Pública - Sector Educación                                  ",5,"ATUNCOLLA","Rural"]
[123,"ATUNCOLLA","PATAS","2053103","I.E.N.  - PATAS","I.E.N.","Educación Básica Regular      ","A1  - Pública - Sector Educación                                  ",6,"ATUNCOLLA","Rural"]
[124,"ATUNCOLLA","JURIA","2053802","I.E.N.  - JURIA","I.E.N.","Educación Básica Regular      ","A1  - Pública - Sector Educación                                  ",7,"ATUNCOLLA","Rural"]
[125,"ATUNCOLLA","CHEJOLLANI","2053807","I.E.N.  - CHEJOLLANI","I.E.N.","Educación Básica Regular      ","A1  - Pública - Sector Educación                                  ",5,"ATUNCOLLA","Rural"]
[126,"ATUNCOLLA","CHOQUELA","2053812","I.E.N.  - CHOQUELA","I.E.N.","Educación Básica Regular      ","A1  - Pública - Sector Educación                                  ",8,"ATUNCOLLA","Rural"]
[127,"ATUNCOLLA","BUENAVISTA","2053819","I.E.N.  - ASUNCION","I.E.N.","Educación Básica Regular      ","A1  - Pública - Sector Educación                                  ",6,{"$f":"+B322","v":"ATUNCOLLA"},"Rural"]
[128,"ATUNCOLLA","JIPA GRANDE Y CHICO","2053827","I.E.N.  - SEMILLITAS","I.E.N.","Educación Básica Regular      ","A1  - Pública - Sector Educación                                  ",3,"ATUNCOLLA","Rural"]
[129,"ATUNCOLLA","CAYLLACUCHO","2053829","I.E.N.  - CAYLLACUCHO","I.E.N.","Educación Básica Regular      ","A1  - Pública - Sector Educación                                  ",6,"ATUNCOLLA","Rural"]
[130,"ATUNCOLLA","CACSI UKU","2053830","I.E.N.  - CACSI UKU","I.E.N.","Educación Básica Regular      ","A1  - Pública - Sector Educación                                  ",7,"ATUNCOLLA","Rural"]
[131,"ATUNCOLLA","ALI GRANDE","2053831","I.E.N.  - ALI GRANDE","I.E.N.","Educación Básica Regular      ","A1  - Pública - Sector Educación                                  ",7,"ATUNCOLLA","Rural"]
[132,"ATUNCOLLA","SANTA BARBARA","2053832","I.E.N.  - SANTA BARBARA","I.E.N.","Educación Básica Regular      ","A1  - Pública - Sector Educación                                  ",9,"ATUNCOLLA","Rural"]
[133,"ATUNCOLLA","SAN JOSE DE PRINCIPIO","2053835","I.E.N.  - SANTA CRUZ","I.E.N.","Educación Básica Regular      ","A1  - Pública - Sector Educación                                  ",7,"ATUNCOLLA","Rural"]
[134,"ATUNCOLLA","PATACANCHA","1746262","I.E.I.  - PATACANCHA","I.E.I.","Educación Básica Regular      ","A1  - Pública - Sector Educación                                  ",8,"ATUNCOLLA","Rural"]
[135,"ATUNCOLLA","LLUNGO","1621283","I.E.I.  - 1248 LLUNGO","I.E.I.","Educación Básica Regular      ","A1  - Pública - Sector Educación                                  ",40,"ATUNCOLLA","Rural"]
[136,"ATUNCOLLA","ULLAGACHI","1621606","I.E.I.  - 1279","I.E.I.","Educación Básica Regular      ","A1  - Pública - Sector Educación                                  ",14,"ATUNCOLLA","Rural"]
[137,"ATUNCOLLA","ANANSAYA","1654979","I.E.I.  - 1300 ANANZAYA","I.E.I.","Educación Básica Regular      ","A1  - Pública - Sector Educación                                  ",8,"ATUNCOLLA","Rural"]
[138,"ATUNCOLLA","SAN JOSE PRINCIPIO","1654987","I.E.I.  - 1301 MUSUQ T'IKITA","I.E.I.","Educación Básica Regular      ","A1  - Pública - Sector Educación                                  ",24,"ATUNCOLLA","Urbana"]
[139,"ATUNCOLLA","BUENAVISTA","1556273","I.E.I.  - 1218 NUEVO AMANECER DE BUENAVISTA","I.E.I.","Educación Básica Regular      ","A1  - Pública - Sector Educación                                  ",14,"ATUNCOLLA","Rural"]
[140,"ATUNCOLLA","COCHELA","3870438","I.E.N.  - VIRGEN SOLEDAD","I.E.N.","Educación Básica Regular      ","A1  - Pública - Sector Educación                                  ",6,"ATUNCOLLA","Rural"]
[141,"ATUNCOLLA","PATACANCHA","3916597","I.E.N.  - HUELLITAS DE AMOR","I.E.N.","Educación Básica Regular      ","A1  - Pública - Sector Educación                                  ",6,"ATUNCOLLA","Rural"]
[142,"ATUNCOLLA","ALI GRANDE","3916599","I.E.N.  - MUNAY WAWITA","I.E.N.","Educación Básica Regular      ","A1  - Pública - Sector Educación                                  ",7,"ATUNCOLLA","Rural"]
[144,"ATUNCOLLA","SAN JERONIMO DE HULLAGACHI","1471002","I.E.I.  - 1192 ULLAGACHI-ATUNCOLLA","I.E.I.","Educación Básica Regular      ","A1  - Pública - Sector Educación                                  ",14,"ATUNCOLLA","Rural"]
[145,"ATUNCOLLA","MORO","1470988","I.E.I.  - 1191 SANTA BARBARA","I.E.I.","Educación Básica Regular      ","A1  - Pública - Sector Educación                                  ",29,"ATUNCOLLA","Rural"]
[146,"CAPACHICA","CAPANO","3870439","I.E.N.  - CAPANO","I.E.N.","Educación Básica Regular      ","A1  - Pública - Sector Educación                                  ",7,"CAPACHICA","Rural"]
[147,"CAPACHICA","SIALE","3885212","I.E.N.  - SIALE","I.E.N.","Educación Básica Regular      ","A1  - Pública - Sector Educación                                  ",4,"CAPACHICA","Rural"]
[148,"CAPACHICA","JAJANRA","1621689","I.E.I.  - 1286","I.E.I.","Educación Básica Regular      ","A1  - Pública - Sector Educación                                  ",7,"CAPACHICA","Rural"]
[149,"CAPACHICA","ISAÑURA","1621614","I.E.I.  - 1232 MISKY WASI","I.E.I.","Educación Básica Regular      ","A1  - Pública - Sector Educación                                  ",20,"CAPACHICA","Rural"]
[150,"CAPACHICA","CCOTOS","1621507","I.E.I.  - 1270 JOSE DE SAN MARTIN","I.E.I.","Educación Básica Regular      ","A1  - Pública - Sector Educación                                  ",10,"CAPACHICA","Rural"]
[151,"CAPACHICA","CCOTOS","1621390","I.E.I.  - 1259","I.E.I.","Educación Básica Regular      ","A1  - Pública - Sector Educación                                  ",6,"CAPACHICA","Rural"]
[152,"CAPACHICA","HILATA","1621424","I.E.I.  - 1262 NIÑO SAN SALVADOR","I.E.I.","Educación Básica Regular      ","A1  - Pública - Sector Educación                                  ",14,"CAPACHICA","Rural"]
[153,"CAPACHICA","TANTEON","1621457","I.E.I.  - 1265 ALFONSO UGARTE","I.E.I.","Educación Básica Regular      ","A1  - Pública - Sector Educación                                  ",10,"CAPACHICA","Rural"]
[154,"CAPACHICA","ESCALLANI","1621465","I.E.I.  - 1266 DON JOSE DE SAN MARTIN","I.E.I.","Educación Básica Regular      ","A1  - Pública - Sector Educación                                  ",16,"CAPACHICA","Rural"]
[155,"CAPACHICA","SANTA MARIA","1623610","I.E.I.  - 1290","I.E.I.","Educación Básica Regular      ","A1  - Pública - Sector Educación                                  ",8,"CAPACHICA","Rural"]
[156,"CAPACHICA","COLLPA","1621366","I.E.I.  - 1256 NIÑO DE JESUS","I.E.I.","Educación Básica Regular      ","A1  - Pública - Sector Educación                                  ",7,"CAPACHICA","Rural"]
[157,"CAPACHICA","LLACHON","1621374","I.E.I.  - 1257","I.E.I.","Educación Básica Regular      ","A1  - Pública - Sector Educación                                  ",9,"CAPACHICA","Rural"]
[158,"CAPACHICA","ESCALLANI","2032512","I.E.N.  - ESCALLANI CENTRAL","I.E.N.","Educación Básica Regular      ","A1  - Pública - Sector Educación                                  ",8,"CAPACHICA","Rural"]
[159,"CAPACHICA","ESCALLANI","2032513","I.E.N.  - ESCALLANI","I.E.N.","Educación Básica Regular      ","A1  - Pública - Sector Educación                                  ",7,"CAPACHICA","Rural"]
[160,"CAPACHICA","CAPANO TOCTORO","2032515","I.E.N.  - JAJANRA","I.E.N.","Educación Básica Regular      ","A1  - Pública - Sector Educación                                  ",5,"CAPACHICA","Rural"]
[161,"CAPACHICA","CCOLLPA","2032516","I.E.N.  - CCOLLPA","I.E.N.","Educación Básica Regular      ","A1  - Pública - Sector Educación                                  ",7,"CAPACHICA","Rural"]
[162,"CAPACHICA","HILATA","2032517","I.E.N.  - UMASUYO","I.E.N.","Educación Básica Regular      ","A1  - Pública - Sector Educación                                  ",8,"CAPACHICA","Rural"]
[163,"CAPACHICA","CCOTOS","2032518","I.E.N.  - CCOTOS I","I.E.N.","Educación Básica Regular      ","A1  - Pública - Sector Educación                                  ",8,"CAPACHICA","Rural"]
[164,"CAPACHICA","YANACACO","2032520","I.E.N.  - YANACACO","I.E.N.","Educación Básica Regular      ","A1  - Pública - Sector Educación                                  ",7,"CAPACHICA","Rural"]
[165,"CAPACHICA","SANTA MARIA","2032521","I.E.N.  - SANTA MARIA CAMPIN","I.E.N.","Educación Básica Regular      ","A1  - Pública - Sector Educación                                  ",6,"CAPACHICA","Rural"]
[166,"CAPACHICA","HILATA","2032523","I.E.N.  - SALLALLIN","I.E.N.","Educación Básica Regular      ","A1  - Pública - Sector Educación                                  ",9,"CAPACHICA","Rural"]
[167,"CAPACHICA","YAPURA","2032524","I.E.N.  - MIRAFLORES DE YAPURA","I.E.N.","Educación Básica Regular      ","A1  - Pública - Sector Educación                                  ",7,"CAPACHICA","Rural"]
[168,"CAPACHICA","SILACACHI","2049602","I.E.N.  - SILICACHI","I.E.N.","Educación Básica Regular      ","A1  - Pública - Sector Educación                                  ",6,"CAPACHICA","Rural"]
[169,"CAPACHICA","CAPANO","2049604","I.E.N.  - HUERTANO","I.E.N.","Educación Básica Regular      ","A1  - Pública - Sector Educación                                  ",7,"CAPACHICA","Rural"]
[170,"CAPACHICA","SAN CRISTOBAL","2049614","I.E.N.  - SAN CRISTOBAL","I.E.N.","Educación Básica Regular      ","A1  - Pública - Sector Educación                                  ",4,"CAPACHICA","Rural"]
[171,"CAPACHICA","SAN SALVADOR","2049615","I.E.N.  - SAN SALVADOR","I.E.N.","Educación Básica Regular      ","A1  - Pública - Sector Educación                                  ",1,"CAPACHICA","Rural"]
[172,"CAPACHICA","SIALE","2050002","I.E.N.  - SIALE","I.E.N.","Educación Básica Regular      ","A1  - Pública - Sector Educación                                  ",6,"CAPACHICA","Rural"]
[173,"CAPACHICA","HILATA","2050007","I.E.N.  - HILATA A","I.E.N.","Educación Básica Regular      ","A1  - Pública - Sector Educación                                  ",5,"CAPACHICA","Rural"]
[174,"CAPACHICA","PARAMIS CHICO","2050009","I.E.N.  - PARAMIS","I.E.N.","Educación Básica Regular      ","A1  - Pública - Sector Educación                                  ",5,"CAPACHICA","Rural"]
[175,"CAPACHICA","CHILLORA","2050701","I.E.N.  - CHILLORA","I.E.N.","Educación Básica Regular      ","A1  - Pública - Sector Educación                                  ",2,"CAPACHICA","Rural"]
[176,"CAPACHICA","CARMEN","2050702","I.E.N.  - CARMEN","I.E.N.","Educación Básica Regular      ","A1  - Pública - Sector Educación                                  ",3,"CAPACHICA","Rural"]
[177,"CAPACHICA","SAN CRISTOBAL","3917314","I.E.N.  - ALTO CRISTAL","I.E.N.","Educación Básica Regular      ","A1  - Pública - Sector Educación                                  ",10,"CAPACHICA","Rural"]
[178,"CAPACHICA","CHAPA","1470921","I.E.I.  - 1200 SEMILLITAS DEL SABER","I.E.I.","Educación Básica Regular      ","A1  - Pública - Sector Educación                                  ",17,"CAPACHICA","Rural"]
[179,"CAPACHICA","CAPANO","1470897","I.E.I.  - 1199 SAN JUAN DE CAPANO","I.E.I.","Educación Básica Regular      ","A1  - Pública - Sector Educación                                  ",8,"CAPACHICA","Rural"]
[180,"CAPACHICA","CAPACHICA","1023282","I.E.I.  - 201","I.E.I.","Educación Básica Regular      ","A1  - Pública - Sector Educación                                  ",31,"CAPACHICA","Urbana"]
[183,"CHUCUITO","ICHU","2062921","I.E.N.  - ESTACION","I.E.N.","Educación Básica Regular      ","A1  - Pública - Sector Educación                                  ",9,"CHUCUITO","Rural"]
[184,"CHUCUITO","ATOJJA","2062922","I.E.N.  - ATOJJA","I.E.N.","Educación Básica Regular      ","A1  - Pública - Sector Educación                                  ",13,"CHUCUITO","Urbana"]
[185,"CHUCUITO","ICHU RAYA","2070501","I.E.N.  - ICHU RAYA","I.E.N.","Educación Básica Regular      ","A1  - Pública - Sector Educación                                  ",8,"CHUCUITO","Rural"]
[186,"CHUCUITO","CAMATA","2070505","I.E.N.  - CAMATA","I.E.N.","Educación Básica Regular      ","A1  - Pública - Sector Educación                                  ",9,"CHUCUITO","Rural"]
[187,"CHUCUITO","PUCANI","2067112","I.E.N.  - PUCANI","I.E.N.","Educación Básica Regular      ","A1  - Pública - Sector Educación                                  ",6,"CHUCUITO","Rural"]
[188,"CHUCUITO","TAJQUINA","2067113","I.E.N.  - TAJQUINA","I.E.N.","Educación Básica Regular      ","A1  - Pública - Sector Educación                                  ",8,"CHUCUITO","Rural"]
[189,"CHUCUITO","CUSIPATA","2067801","I.E.N.  - CUSIPATA","I.E.N.","Educación Básica Regular      ","A1  - Pública - Sector Educación                                  ",9,"CHUCUITO","Rural"]
[190,"CHUCUITO","BARCO","2067802","I.E.N.  - BARCO","I.E.N.","Educación Básica Regular      ","A1  - Pública - Sector Educación                                  ",6,"CHUCUITO","Rural"]
[191,"CHUCUITO","CHINCHERA","2067805","I.E.N.  - CHINCHERA CENTRAL","I.E.N.","Educación Básica Regular      ","A1  - Pública - Sector Educación                                  ",8,"CHUCUITO","Urbana"]
[192,"CHUCUITO","PALLALLA","2067824","I.E.N.  - PAMPA PALLALLA","I.E.N.","Educación Básica Regular      ","A1  - Pública - Sector Educación                                  ",4,"CHUCUITO","Rural"]
[193,"CHUCUITO","CHINCHERA","2067826","I.E.N.  - CHINCHERA","I.E.N.","Educación Básica Regular      ","A1  - Pública - Sector Educación                                  ",8,"CHUCUITO","Urbana"]
[194,"CHUCUITO","HUANCARANE","2067831","I.E.N.  - HUANCARANI","I.E.N.","Educación Básica Regular      ","A1  - Pública - Sector Educación                                  ",5,{"$f":"+B386","v":"CHUCUITO"},"Rural"]
[195,"CHUCUITO","CONCACHI","2068602","I.E.N.  - CONCACHI","I.E.N.","Educación Básica Regular      ","A1  - Pública - Sector Educación                                  ",9,"CHUCUITO","Rural"]
[196,"CHUCUITO","TAJQUINA","2068603","I.E.N.  - TAJQUINA","I.E.N.","Educación Básica Regular      ","A1  - Pública - Sector Educación                                  ",13,"CHUCUITO","Rural"]
[197,"CHUCUITO","BARCO","2063701","I.E.N.  - BARCO","I.E.N.","Educación Básica Regular      ","A1  - Pública - Sector Educación                                  ",4,"CHUCUITO","Rural"]
[198,"CHUCUITO","CONCACHI","2063706","I.E.N.  - CONCACHI II","I.E.N.","Educación Básica Regular      ","A1  - Pública - Sector Educación                                  ",3,"CHUCUITO","Rural"]
[199,"CHUCUITO","BOSQUE","2063715","I.E.N.  - BOSQUE","I.E.N.","Educación Básica Regular      ","A1  - Pública - Sector Educación                                  ",5,"CHUCUITO","Rural"]
[200,"CHUCUITO","CHURO PAMPA","2063720","I.E.N.  - CHURO PAMPA","I.E.N.","Educación Básica Regular      ","A1  - Pública - Sector Educación                                  ",3,"CHUCUITO","Rural"]
[201,"CHUCUITO","KARANA","2063721","I.E.N.  - KARANA","I.E.N.","Educación Básica Regular      ","A1  - Pública - Sector Educación                                  ",3,"CHUCUITO","Rural"]
[202,"CHUCUITO","INQUINCHU","2063722","I.E.N.  - INQUINCHU","I.E.N.","Educación Básica Regular      ","A1  - Pública - Sector Educación                                  ",3,"CHUCUITO","Rural"]
[203,"CHUCUITO","PERKA","2063724","I.E.N.  - PERKA NORTE","I.E.N.","Educación Básica Regular      ","A1  - Pública - Sector Educación                                  ",3,"CHUCUITO","Rural"]
[204,"CHUCUITO","CHINCHERA","2063726","I.E.N.  - CHINCHERA","I.E.N.","Educación Básica Regular      ","A1  - Pública - Sector Educación                                  ",4,"CHUCUITO","Urbana"]
[205,"CHUCUITO","POTOJANI GRANDE","2068608","I.E.N.  - POTOJANI GRANDE I","I.E.N.","Educación Básica Regular      ","A1  - Pública - Sector Educación                                  ",13,"CHUCUITO","Rural"]
[206,"CHUCUITO","POTOJANI CHICO","2068610","I.E.N.  - POTOJANI CHICO","I.E.N.","Educación Básica Regular      ","A1  - Pública - Sector Educación                                  ",8,"CHUCUITO","Rural"]
[207,"CHUCUITO","PATOJANI GRANDE","2068615","I.E.N.  - POTOJANI GRANDE II","I.E.N.","Educación Básica Regular      ","A1  - Pública - Sector Educación                                  ",7,"CHUCUITO","Rural"]
[208,"CHUCUITO","SANTA BARBARA","2070516","I.E.N.  - SANTA BARBARA","I.E.N.","Educación Básica Regular      ","A1  - Pública - Sector Educación                                  ",14,"CHUCUITO","Urbana"]
[209,"CHUCUITO","ICHU RAYA","2070518","I.E.N.  - ICHU RAYA","I.E.N.","Educación Básica Regular      ","A1  - Pública - Sector Educación                                  ",4,"CHUCUITO","Rural"]
[210,"CHUCUITO","COCHIRAYA","1621309","I.E.I.  - 1250 DIVINO CORAZON DE COCHIRAYA","I.E.I.","Educación Básica Regular      ","A1  - Pública - Sector Educación                                  ",10,"CHUCUITO","Rural"]
[211,"CHUCUITO","POTOJANI GRANDE","1621267","I.E.I.  - 1246 SHADDAY","I.E.I.","Educación Básica Regular      ","A1  - Pública - Sector Educación                                  ",16,"CHUCUITO","Rural"]
[212,"CHUCUITO","LUQUINA GRANDE","1621242","I.E.I.  - 1244 SEMILLITAS DEL MAÑANA","I.E.I.","Educación Básica Regular      ","A1  - Pública - Sector Educación                                  ",6,"CHUCUITO","Rural"]
[213,"CHUCUITO","INCHUPALLA","1621168","I.E.I.  - 1236","I.E.I.","Educación Básica Regular      ","A1  - Pública - Sector Educación                                  ",11,"CHUCUITO","Rural"]
[214,"CHUCUITO","TACASAYA","1621697","I.E.I.  - 1287 NIÑOS DEL LAGO SAGRADOS DE TACASAYA","I.E.I.","Educación Básica Regular      ","A1  - Pública - Sector Educación                                  ",8,"CHUCUITO","Rural"]
[215,"CHUCUITO","LUQUINA CHICO","1556372","I.E.I.  - 1209 LAGO SAGRADO DE LUQUINA CHICO","I.E.I.","Educación Básica Regular      ","A1  - Pública - Sector Educación                                  ",4,"CHUCUITO","Rural"]
[216,"CHUCUITO","PARINA","1556406","I.E.I.  - 1210 TESORITOS DE PARINA","I.E.I.","Educación Básica Regular      ","A1  - Pública - Sector Educación                                  ",9,"CHUCUITO","Urbana"]
[217,"CHUCUITO","PARINA","3884997","I.E.N.  - PUCARA","I.E.N.","Educación Básica Regular      ","A1  - Pública - Sector Educación                                  ",2,"CHUCUITO","Urbana"]
[218,"CHUCUITO","HUAIRAPATA","3870428","I.E.N.  - ARICURA","I.E.N.","Educación Básica Regular      ","A1  - Pública - Sector Educación                                  ",2,"CHUCUITO","Rural"]
[219,"CHUCUITO","COCHIRAYA","3870429","I.E.N.  - JISKA COCHIRAYA","I.E.N.","Educación Básica Regular      ","A1  - Pública - Sector Educación                                  ",1,"CHUCUITO","Rural"]
[220,"CHUCUITO","PACHAJONE / PACHAJNE","3916578","I.E.N.  - PACHAJANI","I.E.N.","Educación Básica Regular      ","A1  - Pública - Sector Educación                                  ",1,"CHUCUITO","Rural"]
[221,"CHUCUITO","PIRAPI","3916576","I.E.N.  - QANTATI URURI","I.E.N.","Educación Básica Regular      ","A1  - Pública - Sector Educación                                  ",3,"CHUCUITO","Rural"]
[222,"CHUCUITO","YOCATA","3917329","I.E.N.  - LAS PANQHARITAS","I.E.N.","Educación Básica Regular      ","A1  - Pública - Sector Educación                                  ",2,"CHUCUITO","Rural"]
[224,"CHUCUITO","CARINA","1023449","I.E.I.  - 300","I.E.I.","Educación Básica Regular      ","A1  - Pública - Sector Educación                                  ",13,"CHUCUITO","Rural"]
[226,"CHUCUITO","HUAIRAPATA","1525583","I.E.I.  - 401 NIÑO JESUS","I.E.I.","Educación Básica Regular      ","A1  - Pública - Sector Educación                                  ",15,"CHUCUITO","Rural"]
[227,"COATA","ALMOZANCHE","3884999","I.E.N.  - ALMOZANCHE","I.E.N.","Educación Básica Regular      ","A1  - Pública - Sector Educación                                  ",8,"COATA","Rural"]
[228,"COATA","POJSIN","1556414","I.E.I.  - 1224 NUESTRA SEÑORA VIRGEN DEL ROSARIO","I.E.I.","Educación Básica Regular      ","A1  - Pública - Sector Educación                                  ",3,"COATA","Rural"]
[229,"COATA","PUTUCUNI","1556422","I.E.I.  - 1223 DIVINO NIÑO JESUS","I.E.I.","Educación Básica Regular      ","A1  - Pública - Sector Educación                                  ",13,"COATA","Rural"]
[230,"COATA","SANTA CRUZ DE CAPARA","1556448","I.E.I.  - 1225 VILLA SANTA CRUZ DE SAMUCHACA","I.E.I.","Educación Básica Regular      ","A1  - Pública - Sector Educación                                  ",8,"COATA","Rural"]
[231,"COATA","SUCASCO","1556455","I.E.I.  - 1221","I.E.I.","Educación Básica Regular      ","A1  - Pública - Sector Educación                                  ",61,"COATA","Urbana"]
[233,"COATA","JOCHI SAN FRANCISCO","1556356","I.E.I.  - 1219 PUKLLAY WASI","I.E.I.","Educación Básica Regular      ","A1  - Pública - Sector Educación                                  ",31,"COATA","Urbana"]
[234,"COATA","LLUCO CENTRAL","1556364","I.E.I.  - 1220 SEMILLITAS DEL SEÑOR DE PENTECOSTES","I.E.I.","Educación Básica Regular      ","A1  - Pública - Sector Educación                                  ",20,"COATA","Rural"]
[235,"COATA","ANGEL CARATA","1556265","I.E.I.  - 1208","I.E.I.","Educación Básica Regular      ","A1  - Pública - Sector Educación                                  ",10,"COATA","Rural"]
[236,"COATA","UQUISILLA","1621580","I.E.I.  - 1277 JESUS EMANUEL","I.E.I.","Educación Básica Regular      ","A1  - Pública - Sector Educación                                  ",10,"COATA","Rural"]
[237,"COATA","LLACHAHUI","1621416","I.E.I.  - 1261 LOS ANGELITOS DE JESUS","I.E.I.","Educación Básica Regular      ","A1  - Pública - Sector Educación                                  ",10,"COATA","Rural"]
[238,"COATA","COLLANA LOJERA","1621499","I.E.I.  - 1269 CAPULLITOS DE AMOR","I.E.I.","Educación Básica Regular      ","A1  - Pública - Sector Educación                                  ",15,"COATA","Rural"]
[239,"COATA","CARATA","1626795","I.E.I.  - 1292","I.E.I.","Educación Básica Regular      ","A1  - Pública - Sector Educación                                  ",7,"COATA","Rural"]
[240,"COATA","SANTIAGO SORAZA","1626803","I.E.I.  - 1293 JESUS NAZARENO","I.E.I.","Educación Básica Regular      ","A1  - Pública - Sector Educación                                  ",9,"COATA","Rural"]
[241,"COATA","ACCOPATA","2048118","I.E.N.  - CHINCHE","I.E.N.","Educación Básica Regular      ","A1  - Pública - Sector Educación                                  ",7,"COATA","Rural"]
[242,"COATA","TARIZANI","2048120","I.E.N.  - TARIZANI","I.E.N.","Educación Básica Regular      ","A1  - Pública - Sector Educación                                  ",10,"COATA","Rural"]
[243,"COATA","CANDILE","2048121","I.E.N.  - ANGEL DE LA GUARDA","I.E.N.","Educación Básica Regular      ","A1  - Pública - Sector Educación                                  ",4,"COATA","Rural"]
[244,"COATA","POJSIN CARATA","2048123","I.E.N.  - LAS HORMIGUITAS","I.E.N.","Educación Básica Regular      ","A1  - Pública - Sector Educación                                  ",6,"COATA","Rural"]
[245,"COATA","PUTUCUNI PATA","2048124","I.E.N.  - LOS BALSERITOS","I.E.N.","Educación Básica Regular      ","A1  - Pública - Sector Educación                                  ",7,"COATA","Rural"]
[246,"COATA","URCUNIMUNI SUR","2048827","I.E.N.  - URCUNIMUNI SUR A","I.E.N.","Educación Básica Regular      ","A1  - Pública - Sector Educación                                  ",5,"COATA","Rural"]
[247,"COATA","COLLANA LOJERA","2048828","I.E.N.  - COLLANA LOJERA","I.E.N.","Educación Básica Regular      ","A1  - Pública - Sector Educación                                  ",9,"COATA","Rural"]
[248,"COATA","SUCASCO","2048829","I.E.N.  - MISTICACHI","I.E.N.","Educación Básica Regular      ","A1  - Pública - Sector Educación                                  ",15,"COATA","Urbana"]
[249,"COATA","SORAZA","2048831","I.E.N.  - SORAZA","I.E.N.","Educación Básica Regular      ","A1  - Pública - Sector Educación                                  ",10,"COATA","Rural"]
[250,"COATA","JOCHI SAN FRANCISCO","3917319","I.E.N.  - JOCHI","I.E.N.","Educación Básica Regular      ","A1  - Pública - Sector Educación                                  ",11,"COATA","Urbana"]
[251,"COATA","LLUCO","3917316","I.E.N.  - PUJLLAY WASI","I.E.N.","Educación Básica Regular      ","A1  - Pública - Sector Educación                                  ",7,"COATA","Rural"]
[252,"COATA","SANTA CRUZ","3922318","I.E.N.  - MI PEQUEÑA CASITA","I.E.N.","Educación Básica Regular      ","A1  - Pública - Sector Educación                                  ",8,"COATA","Rural"]
[253,"COATA","MUNOS","3926415","I.E.N.  - PUKLLAY WASI","I.E.N.","Educación Básica Regular      ","A1  - Pública - Sector Educación                                  ",8,"COATA","Rural"]
[254,"COATA","SANTA CRUZ","3926416","I.E.N.  - MUNAY TIKA","I.E.N.","Educación Básica Regular      ","A1  - Pública - Sector Educación                                  ",8,"COATA","Rural"]
[257,"HUATA","YASIN","2047302","I.E.N.  - YASIN","I.E.N.","Educación Básica Regular      ","A1  - Pública - Sector Educación                                  ",8,"HUATA","Rural"]
[258,"HUATA","CHINCHERPAMPA","2047311","I.E.N.  - PABLO MOCCO","I.E.N.","Educación Básica Regular      ","A1  - Pública - Sector Educación                                  ",3,"HUATA","Rural"]
[259,"HUATA","FAON","2047312","I.E.N.  - TUFRE CHAQUI","I.E.N.","Educación Básica Regular      ","A1  - Pública - Sector Educación                                  ",10,"HUATA","Rural"]
[260,"HUATA","QUIVILLACA","2047313","I.E.N.  - JESUS DE PRAGA","I.E.N.","Educación Básica Regular      ","A1  - Pública - Sector Educación                                  ",5,"HUATA","Rural"]
[261,"HUATA","PAMPA YASIN","1621564","I.E.I.  - 1275 ALTA GRACIA DE YASIN","I.E.I.","Educación Básica Regular      ","A1  - Pública - Sector Educación                                  ",18,"HUATA","Rural"]
[262,"HUATA","CHINCHERPAMPA","1654995","I.E.I.  - 1302","I.E.I.","Educación Básica Regular      ","A1  - Pública - Sector Educación                                  ",6,"HUATA","Rural"]
[263,"HUATA","FAON","1655000","I.E.I.  - 1303 SAN MIGUEL DE FAON","I.E.I.","Educación Básica Regular      ","A1  - Pública - Sector Educación                                  ",2,{"$f":"+B450","v":"HUATA"},"Rural"]
[264,"HUATA","QUIVILLACA","1658921","I.E.I.  - 1309 INMACULADA CONCEPCION","I.E.I.","Educación Básica Regular      ","A1  - Pública - Sector Educación                                  ",15,"HUATA","Rural"]
[266,"MAÑAZO","ALTO ALIANZA","1655018","I.E.I.  - 1304 DIVINO NIÑO ALTO ALIANZA","I.E.I.","Educación Básica Regular      ","A1  - Pública - Sector Educación                                  ",23,"MAÑAZO","Urbana"]
[267,"MAÑAZO","MAÑAZO","1679331","I.E.I.  - ALFONSO UGARTE","I.E.I.","Educación Básica Regular      ","A1  - Pública - Sector Educación                                  ",19,"MAÑAZO","Urbana"]
[268,"MAÑAZO","SANTA ROSA","1621572","I.E.I.  - 1276 SANTA ROSA","I.E.I.","Educación Básica Regular      ","A1  - Pública - Sector Educación                                  ",24,"MAÑAZO","Urbana"]
[269,"MAÑAZO","CAHUALLA","1621630","I.E.I.  - 1281 NIÑO JESUS SEMILLITAS DE ESPERANZA","I.E.I.","Educación Básica Regular      ","A1  - Pública - Sector Educación                                  ",9,"MAÑAZO","Rural"]
[270,"MAÑAZO","HUILAMOCCO","1621234","I.E.I.  - 1243","I.E.I.","Educación Básica Regular      ","A1  - Pública - Sector Educación                                  ",13,"MAÑAZO","Rural"]
[271,"MAÑAZO","CHARAMAYA","1556315","I.E.I.  - 1226","I.E.I.","Educación Básica Regular      ","A1  - Pública - Sector Educación                                  ",9,"MAÑAZO","Rural"]
[272,"MAÑAZO","COLLPANI","2040801","I.E.N.  - COLLPANI","I.E.N.","Educación Básica Regular      ","A1  - Pública - Sector Educación                                  ",9,"MAÑAZO","Rural"]
[273,"MAÑAZO","ESTACACHI","2040803","I.E.N.  - ESTACACHI","I.E.N.","Educación Básica Regular      ","A1  - Pública - Sector Educación                                  ",3,"MAÑAZO","Rural"]
[274,"MAÑAZO","CONAVIRI","2040810","I.E.N.  - CONAVIRI","I.E.N.","Educación Básica Regular      ","A1  - Pública - Sector Educación                                  ",4,"MAÑAZO","Rural"]
[275,"MAÑAZO","AÑAZANI","2040811","I.E.N.  - CRECIENDO JUNTOS","I.E.N.","Educación Básica Regular      ","A1  - Pública - Sector Educación                                  ",7,"MAÑAZO","Rural"]
[276,"MAÑAZO","AÑAZANI","2041620","I.E.N.  - AÑAZANI","I.E.N.","Educación Básica Regular      ","A1  - Pública - Sector Educación                                  ",14,"MAÑAZO","Rural"]
[277,"MAÑAZO","JAHUASQUIPA","2041625","I.E.N.  - JAHUASQUIPA","I.E.N.","Educación Básica Regular      ","A1  - Pública - Sector Educación                                  ",5,"MAÑAZO","Rural"]
[278,"MAÑAZO","HACIENDA CANLLACCOLLO","2041626","I.E.N.  - MAXIPATA","I.E.N.","Educación Básica Regular      ","A1  - Pública - Sector Educación                                  ",8,"MAÑAZO","Rural"]
[279,"MAÑAZO","TOTORANI","2041627","I.E.N.  - TOTORANI","I.E.N.","Educación Básica Regular      ","A1  - Pública - Sector Educación                                  ",14,"MAÑAZO","Rural"]
[280,"MAÑAZO","CAHUALLA","3870440","I.E.N.  - CAHUALLA","I.E.N.","Educación Básica Regular      ","A1  - Pública - Sector Educación                                  ",11,"MAÑAZO","Rural"]
[281,"MAÑAZO","CAHUALLA","3870442","I.E.N.  - ARCO IRIS","I.E.N.","Educación Básica Regular      ","A1  - Pública - Sector Educación                                  ",11,"MAÑAZO","Rural"]
[282,"MAÑAZO","QUEARAYA","3870443","I.E.N.  - QUEARAYA","I.E.N.","Educación Básica Regular      ","A1  - Pública - Sector Educación                                  ",9,"MAÑAZO","Rural"]
[283,"MAÑAZO","QUEARAYA","3870444","I.E.N.  - FE Y AMOR","I.E.N.","Educación Básica Regular      ","A1  - Pública - Sector Educación                                  ",13,"MAÑAZO","Rural"]
[284,"MAÑAZO","MAÑAZO","3917320","I.E.N.  - GOTITAS DE FE","I.E.N.","Educación Básica Regular      ","A1  - Pública - Sector Educación                                  ",14,"MAÑAZO","Urbana"]
[287,"PAUCARCOLLA","SANTA BARBARA","3870445","I.E.N.  - LOS ROSALES","I.E.N.","Educación Básica Regular      ","A1  - Pública - Sector Educación                                  ",7,"PAUCARCOLLA","Urbana"]
[288,"PAUCARCOLLA","SANTA BARBARA DE MORO","2053836","I.E.N.  - SUCARI","I.E.N.","Educación Básica Regular      ","A1  - Pública - Sector Educación                                  ",2,"PAUCARCOLLA","Rural"]
[289,"PAUCARCOLLA","ANEXO CORTE","2052313","I.E.N.  - ANEXO CORTE ESTACION","I.E.N.","Educación Básica Regular      ","A1  - Pública - Sector Educación                                  ",8,"PAUCARCOLLA","Rural"]
[290,"PAUCARCOLLA","CHULLARA","2052316","I.E.N.  - CHULLARA","I.E.N.","Educación Básica Regular      ","A1  - Pública - Sector Educación                                  ",7,"PAUCARCOLLA","Rural"]
[291,"PAUCARCOLLA","SAN JOSE DE COLLANA","2052317","I.E.N.  - SAN JOSE DE COLLANA","I.E.N.","Educación Básica Regular      ","A1  - Pública - Sector Educación                                  ",2,"PAUCARCOLLA","Rural"]
[292,"PAUCARCOLLA","ILPAMAYO PATA","2052318","I.E.N.  - SANKAYO","I.E.N.","Educación Básica Regular      ","A1  - Pública - Sector Educación                                  ",5,"PAUCARCOLLA","Rural"]
[293,"PAUCARCOLLA","CANCHARANI","1621150","I.E.I.  - 1235 NIÑO SAN SALVADOR","I.E.I.","Educación Básica Regular      ","A1  - Pública - Sector Educación                                  ",7,"PAUCARCOLLA","Rural"]
[294,"PAUCARCOLLA","CHALE","1621275","I.E.I.  - 1247","I.E.I.","Educación Básica Regular      ","A1  - Pública - Sector Educación                                  ",42,"PAUCARCOLLA","Urbana"]
[295,"PAUCARCOLLA","CUPE","1621325","I.E.I.  - 1252 VIRGEN DE GUADALUPE","I.E.I.","Educación Básica Regular      ","A1  - Pública - Sector Educación                                  ",2,"PAUCARCOLLA","Rural"]
[296,"PAUCARCOLLA","ANTONIANI","1621333","I.E.I.  - 1253 IMACULADA CONCEPCION","I.E.I.","Educación Básica Regular      ","A1  - Pública - Sector Educación                                  ",4,"PAUCARCOLLA","Rural"]
[297,"PAUCARCOLLA","YANICO / TITILE","1621556","I.E.I.  - 1274 SEMILLITAS DEL FUTURO","I.E.I.","Educación Básica Regular      ","A1  - Pública - Sector Educación                                  ",11,"PAUCARCOLLA","Rural"]
[298,"PAUCARCOLLA","CORTE ESTACION","1621473","I.E.I.  - 1267 RAYITOS DE SOL","I.E.I.","Educación Básica Regular      ","A1  - Pública - Sector Educación                                  ",7,"PAUCARCOLLA","Rural"]
[299,"PAUCARCOLLA","CORTE ESTACION","3917321","I.E.N.  - LAS CARMELITAS","I.E.N.","Educación Básica Regular      ","A1  - Pública - Sector Educación                                  ",8,"PAUCARCOLLA","Rural"]
[303,"PICHACANI","ANTAJAHUI","2055603","I.E.N.  - ANTAJAHUI","I.E.N.","Educación Básica Regular      ","A1  - Pública - Sector Educación                                  ",6,"PICHACANI","Rural"]
[304,"PICHACANI","CHUNCARA","2055604","I.E.N.  - CHUNCARA","I.E.N.","Educación Básica Regular      ","A1  - Pública - Sector Educación                                  ",11,"PICHACANI","Rural"]
[305,"PICHACANI","ÑUÑUMARCA","2055605","I.E.N.  - ÑUÑUMARCA","I.E.N.","Educación Básica Regular      ","A1  - Pública - Sector Educación                                  ",3,"PICHACANI","Rural"]
[306,"PICHACANI","SUPUCACHI","2055608","I.E.N.  - SUPUCACHI","I.E.N.","Educación Básica Regular      ","A1  - Pública - Sector Educación                                  ",5,"PICHACANI","Rural"]
[307,"PICHACANI","ANCCACCA","2056418","I.E.N.  - DULCES SUEÑOS","I.E.N.","Educación Básica Regular      ","A1  - Pública - Sector Educación                                  ",11,"PICHACANI","Rural"]
[308,"PICHACANI","CHUNCARA","2056419","I.E.N.  - NIÑO JESUS","I.E.N.","Educación Básica Regular      ","A1  - Pública - Sector Educación                                  ",9,"PICHACANI","Rural"]
[309,"PICHACANI","SOQUESANI","2056421","I.E.N.  - SEMILLITAS","I.E.N.","Educación Básica Regular      ","A1  - Pública - Sector Educación                                  ",20,"PICHACANI","Rural"]
[310,"PICHACANI","ANCCACCA","2056423","I.E.N.  - HUELLITAS","I.E.N.","Educación Básica Regular      ","A1  - Pública - Sector Educación                                  ",7,"PICHACANI","Rural"]
[311,"PICHACANI","CATACORANI","2056424","I.E.N.  - DULCE AMANECER","I.E.N.","Educación Básica Regular      ","A1  - Pública - Sector Educación                                  ",8,"PICHACANI","Rural"]
[312,"PICHACANI","LLANKANI","2056426","I.E.N.  - MIS PASITOS","I.E.N.","Educación Básica Regular      ","A1  - Pública - Sector Educación                                  ",12,"PICHACANI","Rural"]
[313,"PICHACANI","AQUECHIA","2057202","I.E.N.  - AQUECHIA","I.E.N.","Educación Básica Regular      ","A1  - Pública - Sector Educación                                  ",6,"PICHACANI","Rural"]
[314,"PICHACANI","LORIPONGO","2057205","I.E.N.  - LORIPONGO","I.E.N.","Educación Básica Regular      ","A1  - Pública - Sector Educación                                  ",6,"PICHACANI","Rural"]
[315,"PICHACANI","CARUCAYA","2057207","I.E.N.  - CARUCAYA","I.E.N.","Educación Básica Regular      ","A1  - Pública - Sector Educación                                  ",5,"PICHACANI","Rural"]
[316,"PICHACANI","NAZAPARCO","2057208","I.E.N.  - NAZAPARCO","I.E.N.","Educación Básica Regular      ","A1  - Pública - Sector Educación                                  ",4,"PICHACANI","Rural"]
[317,"PICHACANI","ANGOSTURA","2057210","I.E.N.  - ANGOSTURA","I.E.N.","Educación Básica Regular      ","A1  - Pública - Sector Educación                                  ",4,"PICHACANI","Rural"]
[318,"PICHACANI","CUTIMBO","2057211","I.E.N.  - CUTIMBO","I.E.N.","Educación Básica Regular      ","A1  - Pública - Sector Educación                                  ",3,"PICHACANI","Rural"]
[319,"PICHACANI","CUCHUCHUNI","2057216","I.E.N.  - CUCHUCHUNI","I.E.N.","Educación Básica Regular      ","A1  - Pública - Sector Educación                                  ",8,"PICHACANI","Rural"]
[320,"PICHACANI","ISCA SOQUESANI","2057220","I.E.N.  - ISCA SOQUESANI","I.E.N.","Educación Básica Regular      ","A1  - Pública - Sector Educación                                  ",6,"PICHACANI","Rural"]
[321,"PICHACANI","ARBOLEDA","1710680","I.E.I.  - ARBOLEDA","I.E.I.","Educación Básica Regular      ","A1  - Pública - Sector Educación                                  ",14,"PICHACANI","Rural"]
[322,"PICHACANI","CHUNCARA","3870446","I.E.N.  - LOS ANGELITOS","I.E.N.","Educación Básica Regular      ","A1  - Pública - Sector Educación                                  ",16,"PICHACANI","Rural"]
[323,"PICHACANI","SOQUESANI","3870447","I.E.N.  - ESTRELLITAS","I.E.N.","Educación Básica Regular      ","A1  - Pública - Sector Educación                                  ",12,"PICHACANI","Rural"]
[324,"PICHACANI","TOLAMARCA","3870448","I.E.N.  - TOLAMARCA","I.E.N.","Educación Básica Regular      ","A1  - Pública - Sector Educación                                  ",5,"PICHACANI","Rural"]
[325,"PICHACANI","JAYUNCURA","3870449","I.E.N.  - JAYUNCORA","I.E.N.","Educación Básica Regular      ","A1  - Pública - Sector Educación                                  ",18,"PICHACANI","Rural"]
[326,"PICHACANI","HACIENDA VILUYO","3917323","I.E.N.  - VILUYO","I.E.N.","Educación Básica Regular      ","A1  - Pública - Sector Educación                                  ",3,"PICHACANI","Rural"]
[327,"PICHACANI","MALLKOAMAYO","3916579","I.E.N.  - MALCOMAYO","I.E.N.","Educación Básica Regular      ","A1  - Pública - Sector Educación                                  ",5,"PICHACANI","Rural"]
[328,"PICHACANI","SOQUESANI","1025568","I.E.I.  - 299","I.E.I.","Educación Básica Regular      ","A1  - Pública - Sector Educación                                  ",27,"PICHACANI","Rural"]
[329,"PICHACANI","HUARIJUYO","1372853","I.E.I.  - 380 HUARIJUYO","I.E.I.","Educación Básica Regular      ","A1  - Pública - Sector Educación                                  ",20,"PICHACANI","Rural"]
[332,"PICHACANI","ANCACCA","1470863","I.E.I.  - 1204 LOS PEQUEÑOS CONQUISTADORES","I.E.I.","Educación Básica Regular      ","A1  - Pública - Sector Educación                                  ",15,"PICHACANI","Rural"]
[333,"PLATERIA","RINCONADA","2064501","I.E.N.  - RINCONADA","I.E.N.","Educación Básica Regular      ","A1  - Pública - Sector Educación                                  ",9,"PLATERIA","Rural"]
[334,"PLATERIA","TITILACA","2064506","I.E.N.  - TITILACA","I.E.N.","Educación Básica Regular      ","A1  - Pública - Sector Educación                                  ",8,"PLATERIA","Rural"]
[335,"PLATERIA","HUENCALLA","2064507","I.E.N.  - HUENCALLA","I.E.N.","Educación Básica Regular      ","A1  - Pública - Sector Educación                                  ",8,{"$f":"+B514","v":"PLATERIA"},"Rural"]
[336,"PLATERIA","JACHA TITILACA","2064508","I.E.N.  - JACHA TITILACA","I.E.N.","Educación Básica Regular      ","A1  - Pública - Sector Educación                                  ",4,"PLATERIA","Rural"]
[337,"PLATERIA","TORASAYA","2064510","I.E.N.  - TORASAYA","I.E.N.","Educación Básica Regular      ","A1  - Pública - Sector Educación                                  ",5,"PLATERIA","Rural"]
[338,"PLATERIA","PALLALLA","2064511","I.E.N.  - PALLALLA","I.E.N.","Educación Básica Regular      ","A1  - Pública - Sector Educación                                  ",5,"PLATERIA","Rural"]
[339,"PLATERIA","THALACA","2064514","I.E.N.  - THALACA","I.E.N.","Educación Básica Regular      ","A1  - Pública - Sector Educación                                  ",5,"PLATERIA","Rural"]
[340,"PLATERIA","WILQUE","2064516","I.E.N.  - WILQUE","I.E.N.","Educación Básica Regular      ","A1  - Pública - Sector Educación                                  ",5,"PLATERIA","Rural"]
[341,"PLATERIA","PERCA","2064518","I.E.N.  - PERKA CHUÑAHUI","I.E.N.","Educación Básica Regular      ","A1  - Pública - Sector Educación                                  ",4,"PLATERIA","Rural"]
[342,"PLATERIA","LACCONI","2064519","I.E.N.  - LACONI","I.E.N.","Educación Básica Regular      ","A1  - Pública - Sector Educación                                  ",2,"PLATERIA","Rural"]
[343,"PLATERIA","PATOJANI CHICO","2068607","I.E.N.  - POTOJANI CHICO","I.E.N.","Educación Básica Regular      ","A1  - Pública - Sector Educación                                  ",4,"PLATERIA","Rural"]
[344,"PLATERIA","CAMATA","1556281","I.E.I.  - 1207 SANTA ROSA","I.E.I.","Educación Básica Regular      ","A1  - Pública - Sector Educación                                  ",15,"PLATERIA","Rural"]
[345,"PLATERIA","PERCA","1621713","I.E.I.  - 1289 ESPONGITAS DEL SABER","I.E.I.","Educación Básica Regular      ","A1  - Pública - Sector Educación                                  ",23,"PLATERIA","Rural"]
[346,"PLATERIA","SIHUECANI","1621226","I.E.I.  - 1242","I.E.I.","Educación Básica Regular      ","A1  - Pública - Sector Educación                                  ",12,"PLATERIA","Rural"]
[347,"PLATERIA","CHILATA","1679349","I.E.I.  - CHILATA","I.E.I.","Educación Básica Regular      ","A1  - Pública - Sector Educación                                  ",6,"PLATERIA","Rural"]
[348,"PLATERIA","CHICABOTIJA","3916580","I.E.N.  - JATHITANACA","I.E.N.","Educación Básica Regular      ","A1  - Pública - Sector Educación                                  ",3,"PLATERIA","Rural"]
[349,"PLATERIA","PHUTINI","3916585","I.E.N.  - PHUTINI CCACA","I.E.N.","Educación Básica Regular      ","A1  - Pública - Sector Educación                                  ",6,"PLATERIA","Rural"]
[350,"PLATERIA","SIHUECANI","3922313","I.E.N.  - SIHUECANI","I.E.N.","Educación Básica Regular      ","A1  - Pública - Sector Educación                                  ",3,"PLATERIA","Rural"]
[351,"PLATERIA","AÑO CALLEJON","1470889","I.E.I.  - 1201","I.E.I.","Educación Básica Regular      ","A1  - Pública - Sector Educación                                  ",9,"PLATERIA","Rural"]
[353,"PLATERIA","CCOTA","0229625","I.E.I.  - 202","I.E.I.","Educación Básica Regular      ","A1  - Pública - Sector Educación                                  ",26,"PLATERIA","Urbana"]
[354,"PLATERIA","CAMACANI","0229740","I.E.I.  - 214 NIÑO JESUS DE PRAGA","I.E.I.","Educación Básica Regular      ","A1  - Pública - Sector Educación                                  ",21,"PLATERIA","Urbana"]
[356,"PUNO","PUNO","1679364","I.E.I.  - MANTO","I.E.I.","Educación Básica Regular      ","A1  - Pública - Sector Educación                                  ",17,"PUNO","Urbana"]
[357,"PUNO","PUNO","1679372","I.E.I.  - VICTOR RAUL HAYA DE LA TORRE","I.E.I.","Educación Básica Regular      ","A1  - Pública - Sector Educación                                  ",13,"PUNO","Urbana"]
[358,"PUNO","CHIMU","1679398","I.E.I.  - 70160","I.E.I.","Educación Básica Regular      ","A1  - Pública - Sector Educación                                  ",20,"PUNO","Rural"]
[359,"PUNO","ISLA CCAPI LOS UROS","1655026","I.E.I.  - 1305 SUMA K'ANTAWI","I.E.I.","Educación Básica Regular      ","A1  - Pública - Sector Educación                                  ",30,"PUNO","Rural"]
[360,"PUNO","MACHALLATA","1659788","I.E.I.  - 1294 DULCE INFANCIA","I.E.I.","Educación Básica Regular      ","A1  - Pública - Sector Educación                                  ",31,"PUNO","Urbana"]
[361,"PUNO","PUNO","1621143","I.E.I.  - 1234 CAPULLITOS DE LA VIRGEN INMACULADA CONCEPCION","I.E.I.","Educación Básica Regular      ","A1  - Pública - Sector Educación                                  ",11,"PUNO","Urbana"]
[363,"PUNO","MANTO NUEVA ESPERANZA","1556398","I.E.I.  - 1228 NUEVA ESPERANZA","I.E.I.","Educación Básica Regular      ","A1  - Pública - Sector Educación                                  ",31,"PUNO","Urbana"]
[364,"PUNO","PUNO","1556257","I.E.I.  - 1227","I.E.I.","Educación Básica Regular      ","A1  - Pública - Sector Educación                                  ",18,"PUNO","Urbana"]
[366,"PUNO","ALTO PUNO","1578483","I.E.I.  - 1231 RETOÑITOS","I.E.I.","Educación Básica Regular      ","A1  - Pública - Sector Educación                                  ",23,"PUNO","Urbana"]
[367,"PUNO","PUNO","2138708","I.E.N.  - BELLAVISTA","I.E.N.","Educación Básica Regular      ","A1  - Pública - Sector Educación                                  ",8,"PUNO","Urbana"]
[368,"PUNO","PUNO","2033301","I.E.N.  - PORTEÑO","I.E.N.","Educación Básica Regular      ","A1  - Pública - Sector Educación                                  ",15,"PUNO","Urbana"]
[369,"PUNO","PUNO","2033304","I.E.N.  - RIVERA DEL LAGO","I.E.N.","Educación Básica Regular      ","A1  - Pública - Sector Educación                                  ",14,"PUNO","Urbana"]
[370,"PUNO","PUNO","2033308","I.E.N.  - VILLA ZUÑIGA","I.E.N.","Educación Básica Regular      ","A1  - Pública - Sector Educación                                  ",16,"PUNO","Urbana"]
[371,"PUNO","PUNO","2033309","I.E.N.  - SANTA ROSA","I.E.N.","Educación Básica Regular      ","A1  - Pública - Sector Educación                                  ",15,"PUNO","Urbana"]
[372,"PUNO","PUNO","2033311","I.E.N.  - VILLA HERMOSA","I.E.N.","Educación Básica Regular      ","A1  - Pública - Sector Educación                                  ",15,"PUNO","Urbana"]
[373,"PUNO","PUNO","2033312","I.E.N.  - DIVINO NIÑO JESUS","I.E.N.","Educación Básica Regular      ","A1  - Pública - Sector Educación                                  ",14,"PUNO","Urbana"]
[374,"PUNO","PUNO","2033313","I.E.N.  - LOS ANGELITOS","I.E.N.","Educación Básica Regular      ","A1  - Pública - Sector Educación                                  ",15,"PUNO","Urbana"]
[375,"PUNO","PUNO","2033317","I.E.N.  - INMACULADA CONCEPCION","I.E.N.","Educación Básica Regular      ","A1  - Pública - Sector Educación                                  ",12,"PUNO","Urbana"]
[376,"PUNO","PUNO","2033318","I.E.N.  - JOSE ANTONIO ENCINAS","I.E.N.","Educación Básica Regular      ","A1  - Pública - Sector Educación                                  ",15,"PUNO","Urbana"]
[377,"PUNO","PUNO","2033319","I.E.N.  - BELLAVISTA NOR ESTE","I.E.N.","Educación Básica Regular      ","A1  - Pública - Sector Educación                                  ",10,"PUNO","Urbana"]
[378,"PUNO","ISLA KAPI CRUZ GRANDE","2033320","I.E.N.  - NUEVO AMANECER","I.E.N.","Educación Básica Regular      ","A1  - Pública - Sector Educación                                  ",6,"PUNO","Rural"]
[379,"PUNO","MANTO CENTRAL","2033321","I.E.N.  - SAN LUIS DE ALBA","I.E.N.","Educación Básica Regular      ","A1  - Pública - Sector Educación                                  ",11,"PUNO","Urbana"]
[380,"PUNO","OJHERANI","2034101","I.E.N.  - OJHERANI","I.E.N.","Educación Básica Regular      ","A1  - Pública - Sector Educación                                  ",6,"PUNO","Rural"]
[381,"PUNO","PUNO","2034102","I.E.N.  - HUAYNA PUCARA","I.E.N.","Educación Básica Regular      ","A1  - Pública - Sector Educación                                  ",12,"PUNO","Urbana"]
[382,"PUNO","RANCHO PUNCO - SALCEDO","2034103","I.E.N.  - RANCHO PUNCO - SALCEDO","I.E.N.","Educación Básica Regular      ","A1  - Pública - Sector Educación                                  ",6,"PUNO","Urbana"]
[383,"PUNO","JAYLLIHUAYA","2034104","I.E.N.  - JAYLLIHUAYA","I.E.N.","Educación Básica Regular      ","A1  - Pública - Sector Educación                                  ",8,"PUNO","Urbana"]
[384,"PUNO","PUNO","2034105","I.E.N.  - SIMON BOLIVAR","I.E.N.","Educación Básica Regular      ","A1  - Pública - Sector Educación                                  ",10,"PUNO","Urbana"]
[385,"PUNO","PUNO","2034110","I.E.N.  - MUNICIPAL PORTEÑO","I.E.N.","Educación Básica Regular      ","A1  - Pública - Sector Educación                                  ",21,"PUNO","Urbana"]
[386,"PUNO","PUNO","2034111","I.E.N.  - PROGRESO","I.E.N.","Educación Básica Regular      ","A1  - Pública - Sector Educación                                  ",14,"PUNO","Urbana"]
[387,"PUNO","PUNO","2034113","I.E.N.  - LAYKAKOTA","I.E.N.","Educación Básica Regular      ","A1  - Pública - Sector Educación                                  ",11,"PUNO","Urbana"]
[388,"PUNO","PUNO","2034801","I.E.N.  - 8 DE OCTUBRE","I.E.N.","Educación Básica Regular      ","A1  - Pública - Sector Educación                                  ",13,"PUNO","Urbana"]
[389,"PUNO","PUNO","2034802","I.E.N.  - RICARDO PALMA","I.E.N.","Educación Básica Regular      ","A1  - Pública - Sector Educación                                  ",15,"PUNO","Urbana"]
[390,"PUNO","PUNO","2034803","I.E.N.  - SAN MARTIN","I.E.N.","Educación Básica Regular      ","A1  - Pública - Sector Educación                                  ",16,"PUNO","Urbana"]
[391,"PUNO","MANTO NORTE","2034807","I.E.N.  - MANTO NORTE","I.E.N.","Educación Básica Regular      ","A1  - Pública - Sector Educación                                  ",16,"PUNO","Urbana"]
[392,"PUNO","VILLA SANTA ROSA","2034810","I.E.N.  - VILLA SANTA ROSA","I.E.N.","Educación Básica Regular      ","A1  - Pública - Sector Educación                                  ",14,"PUNO","Urbana"]
[393,"PUNO","SANTA CRUZ","2034811","I.E.N.  - SANTA CRUZ","I.E.N.","Educación Básica Regular      ","A1  - Pública - Sector Educación                                  ",21,"PUNO","Urbana"]
[394,"PUNO","LEONCIO PRADO","2034812","I.E.N.  - LEONCIO PRADO","I.E.N.","Educación Básica Regular      ","A1  - Pública - Sector Educación                                  ",11,"PUNO","Urbana"]
[395,"PUNO","PUNO","2035106","I.E.N.  - VALLECITO B","I.E.N.","Educación Básica Regular      ","A1  - Pública - Sector Educación                                  ",15,"PUNO","Urbana"]
[396,"PUNO","PUNO","2035107","I.E.N.  - MACHALLATA","I.E.N.","Educación Básica Regular      ","A1  - Pública - Sector Educación                                  ",8,"PUNO","Urbana"]
[397,"PUNO","PUNO","2035801","I.E.N.  - PAMPILLA A","I.E.N.","Educación Básica Regular      ","A1  - Pública - Sector Educación                                  ",12,"PUNO","Urbana"]
[398,"PUNO","PUNO","2035802","I.E.N.  - PAMPILLA B","I.E.N.","Educación Básica Regular      ","A1  - Pública - Sector Educación                                  ",25,"PUNO","Urbana"]
[399,"PUNO","PUNO","2035809","I.E.N.  - PAMPILLA C","I.E.N.","Educación Básica Regular      ","A1  - Pública - Sector Educación                                  ",23,"PUNO","Urbana"]
[400,"PUNO","PUNO","2035812","I.E.N.  - LAS CRUCES","I.E.N.","Educación Básica Regular      ","A1  - Pública - Sector Educación                                  ",13,"PUNO","Urbana"]
[401,"PUNO","PUNO","2035813","I.E.N.  - BELLAVISTA NOR-ESTE","I.E.N.","Educación Básica Regular      ","A1  - Pública - Sector Educación                                  ",10,"PUNO","Urbana"]
[402,"PUNO","PUNO","2035815","I.E.N.  - LAS MERCEDES","I.E.N.","Educación Básica Regular      ","A1  - Pública - Sector Educación                                  ",5,"PUNO","Urbana"]
[403,"PUNO","PUNO","2035817","I.E.N.  - VILLA FLORIDA","I.E.N.","Educación Básica Regular      ","A1  - Pública - Sector Educación                                  ",6,{"$f":"+B578","v":"PUNO"},"Urbana"]
[404,"PUNO","URUS CHULLUNI","2035818","I.E.N.  - GAVIOTITAS","I.E.N.","Educación Básica Regular      ","A1  - Pública - Sector Educación                                  ",19,"PUNO","Rural"]
[405,"PUNO","PUNO","2036601","I.E.N.  - SEÑOR DE HUANCA A","I.E.N.","Educación Básica Regular      ","A1  - Pública - Sector Educación                                  ",15,"PUNO","Urbana"]
[406,"PUNO","PUNO","2036602","I.E.N.  - ALTO HUASCAR","I.E.N.","Educación Básica Regular      ","A1  - Pública - Sector Educación                                  ",11,"PUNO","Urbana"]
[407,"PUNO","PUNO","2036603","I.E.N.  - ANDRES AVELINO CACERES","I.E.N.","Educación Básica Regular      ","A1  - Pública - Sector Educación                                  ",12,"PUNO","Urbana"]
[408,"PUNO","CANCHARANI","2036605","I.E.N.  - CANCHARANI","I.E.N.","Educación Básica Regular      ","A1  - Pública - Sector Educación                                  ",5,"PUNO","Urbana"]
[409,"PUNO","SALCEDO TEPRO","2036607","I.E.N.  - VILLA PRIMAVERA","I.E.N.","Educación Básica Regular      ","A1  - Pública - Sector Educación                                  ",11,"PUNO","Urbana"]
[410,"PUNO","PUNO","2036609","I.E.N.  - CHACARILLA ALTA","I.E.N.","Educación Básica Regular      ","A1  - Pública - Sector Educación                                  ",9,"PUNO","Urbana"]
[411,"PUNO","PUNO","2036611","I.E.N.  - CHANU CHANU","I.E.N.","Educación Básica Regular      ","A1  - Pública - Sector Educación                                  ",10,"PUNO","Urbana"]
[412,"PUNO","ANDRES AVELINO CACERES","2036613","I.E.N.  - ANDRES AVELINO CACERES","I.E.N.","Educación Básica Regular      ","A1  - Pública - Sector Educación                                  ",7,"PUNO","Urbana"]
[413,"PUNO","PUNO","2036615","I.E.N.  - HUASCAR","I.E.N.","Educación Básica Regular      ","A1  - Pública - Sector Educación                                  ",8,"PUNO","Urbana"]
[414,"PUNO","PIURA PIURANI","2036617","I.E.N.  - PIRUAPIRUANI","I.E.N.","Educación Básica Regular      ","A1  - Pública - Sector Educación                                  ",18,"PUNO","Urbana"]
[415,"PUNO","CHANU CHANU ETAPA 1","2036618","I.E.N.  - CENTRAL CHANU CHANU","I.E.N.","Educación Básica Regular      ","A1  - Pública - Sector Educación                                  ",14,"PUNO","Urbana"]
[416,"PUNO","UROS CHULLUNI","2036619","I.E.N.  - UROS CHULLUNI","I.E.N.","Educación Básica Regular      ","A1  - Pública - Sector Educación                                  ",8,"PUNO","Rural"]
[417,"PUNO","ALTO PUNO","2037401","I.E.N.  - SEÑOR DE HUANCA B","I.E.N.","Educación Básica Regular      ","A1  - Pública - Sector Educación                                  ",20,"PUNO","Urbana"]
[418,"PUNO","ALTO PUNO","2037402","I.E.N.  - 27 DE JUNIO","I.E.N.","Educación Básica Regular      ","A1  - Pública - Sector Educación                                  ",11,"PUNO","Urbana"]
[419,"PUNO","TUNUHUIRI","2037404","I.E.N.  - TUNUHUIRI","I.E.N.","Educación Básica Regular      ","A1  - Pública - Sector Educación                                  ",12,"PUNO","Rural"]
[420,"PUNO","PUNO","2037409","I.E.N.  - LA UNION","I.E.N.","Educación Básica Regular      ","A1  - Pública - Sector Educación                                  ",7,"PUNO","Urbana"]
[421,"PUNO","PUNO","2037429","I.E.N.  - 4 DE NOVIEMBRE B","I.E.N.","Educación Básica Regular      ","A1  - Pública - Sector Educación                                  ",5,"PUNO","Urbana"]
[422,"PUNO","PUNO","2037434","I.E.N.  - MANTO","I.E.N.","Educación Básica Regular      ","A1  - Pública - Sector Educación                                  ",8,"PUNO","Urbana"]
[423,"PUNO","PUNO","2038209","I.E.N.  - INDEPENDENCIA","I.E.N.","Educación Básica Regular      ","A1  - Pública - Sector Educación                                  ",7,"PUNO","Urbana"]
[424,"PUNO","CHANU CHANU","2038213","I.E.N.  - CHANU CHANU","I.E.N.","Educación Básica Regular      ","A1  - Pública - Sector Educación                                  ",10,"PUNO","Urbana"]
[425,"PUNO","PUNO","2038912","I.E.N.  - LAYKAKOTA A","I.E.N.","Educación Básica Regular      ","A1  - Pública - Sector Educación                                  ",7,"PUNO","Urbana"]
[426,"PUNO","PUNO","2038915","I.E.N.  - SIMON BOLIVAR A","I.E.N.","Educación Básica Regular      ","A1  - Pública - Sector Educación                                  ",7,"PUNO","Urbana"]
[427,"PUNO","PUNO","2038919","I.E.N.  - 4 DE NOVIEMBRE","I.E.N.","Educación Básica Regular      ","A1  - Pública - Sector Educación                                  ",13,"PUNO","Urbana"]
[428,"PUNO","4 DE NOVIEMBRE","2038920","I.E.N.  - 4 DE NOVIEMBRE","I.E.N.","Educación Básica Regular      ","A1  - Pública - Sector Educación                                  ",6,"PUNO","Urbana"]
[429,"PUNO","PUNO","2038921","I.E.N.  - SAN MARTIN","I.E.N.","Educación Básica Regular      ","A1  - Pública - Sector Educación                                  ",6,"PUNO","Urbana"]
[430,"PUNO","4 DE NOVIEMBRE","2038922","I.E.N.  - 4 DE NOVIEMBRE A","I.E.N.","Educación Básica Regular      ","A1  - Pública - Sector Educación                                  ",7,"PUNO","Urbana"]
[431,"PUNO","PUNO","2038923","I.E.N.  - LAYKAKOTA C","I.E.N.","Educación Básica Regular      ","A1  - Pública - Sector Educación                                  ",8,"PUNO","Urbana"]
[432,"PUNO","PUNO","2038929","I.E.N.  - SIMON BOLIVAR B","I.E.N.","Educación Básica Regular      ","A1  - Pública - Sector Educación                                  ",7,"PUNO","Urbana"]
[433,"PUNO","SAN MARTIN","2038931","I.E.N.  - RAYITO DE LUZ","I.E.N.","Educación Básica Regular      ","A1  - Pública - Sector Educación                                  ",7,"PUNO","Urbana"]
[434,"PUNO","PUNO","2039001","I.E.N.  - PAMPILLA A","I.E.N.","Educación Básica Regular      ","A1  - Pública - Sector Educación                                  ",10,"PUNO","Urbana"]
[435,"PUNO","PUNO","2039002","I.E.N.  - PAMPILLA B","I.E.N.","Educación Básica Regular      ","A1  - Pública - Sector Educación                                  ",11,"PUNO","Urbana"]
[436,"PUNO","PUNO","2039003","I.E.N.  - PORTEÑO A","I.E.N.","Educación Básica Regular      ","A1  - Pública - Sector Educación                                  ",12,"PUNO","Urbana"]
[437,"PUNO","PUNO","2039004","I.E.N.  - PORTEÑO B","I.E.N.","Educación Básica Regular      ","A1  - Pública - Sector Educación                                  ",9,"PUNO","Urbana"]
[438,"PUNO","PUNO","2039007","I.E.N.  - VALLECITO A","I.E.N.","Educación Básica Regular      ","A1  - Pública - Sector Educación                                  ",10,"PUNO","Urbana"]
[439,"PUNO","PUNO","2039008","I.E.N.  - SALCEDO","I.E.N.","Educación Básica Regular      ","A1  - Pública - Sector Educación                                  ",5,"PUNO","Urbana"]
[440,"PUNO","INDEPENDENCIA","2039016","I.E.N.  - NIÑO DIVINO","I.E.N.","Educación Básica Regular      ","A1  - Pública - Sector Educación                                  ",4,"PUNO","Urbana"]
[441,"PUNO","PUNO","2039018","I.E.N.  - INDEPENDENCIA A","I.E.N.","Educación Básica Regular      ","A1  - Pública - Sector Educación                                  ",8,"PUNO","Urbana"]
[442,"PUNO","PUNO","2039020","I.E.N.  - MANTO A","I.E.N.","Educación Básica Regular      ","A1  - Pública - Sector Educación                                  ",10,"PUNO","Urbana"]
[443,"PUNO","PUNO","2039021","I.E.N.  - NIÑO DE LA MISERICORDIA","I.E.N.","Educación Básica Regular      ","A1  - Pública - Sector Educación                                  ",8,"PUNO","Urbana"]
[444,"PUNO","PUNO","2039023","I.E.N.  - CORAZON DE JESUS","I.E.N.","Educación Básica Regular      ","A1  - Pública - Sector Educación                                  ",9,"PUNO","Urbana"]
[445,"PUNO","PUNO","2039703","I.E.N.  - LAS CRUCES","I.E.N.","Educación Básica Regular      ","A1  - Pública - Sector Educación                                  ",7,"PUNO","Urbana"]
[446,"PUNO","MI PERU","1746270","I.E.I.  - MI PERU","I.E.I.","Educación Básica Regular      ","A1  - Pública - Sector Educación                                  ",7,"PUNO","Rural"]
[447,"PUNO","SALCEDO","1746288","I.E.I.  - RINCONADA SALCEDO","I.E.I.","Educación Básica Regular      ","A1  - Pública - Sector Educación                                  ",9,"PUNO","Urbana"]
[448,"PUNO","ALTO HUASCAR","1746296","I.E.I.  - ALTO HUASCAR","I.E.I.","Educación Básica Regular      ","A1  - Pública - Sector Educación                                  ",7,"PUNO","Urbana"]
[449,"PUNO","SAN ANTONIO","3870420","I.E.N.  - SAN ANTONIO DE PADUA A","I.E.N.","Educación Básica Regular      ","A1  - Pública - Sector Educación                                  ",8,"PUNO","Urbana"]
[450,"PUNO","SAN ANTONIO","3870421","I.E.N.  - SAN ANTONIO DE PADUA B","I.E.N.","Educación Básica Regular      ","A1  - Pública - Sector Educación                                  ",9,"PUNO","Urbana"]
[451,"PUNO","BELLAVISTA","3870422","I.E.N.  - ANGEL DIVINO","I.E.N.","Educación Básica Regular      ","A1  - Pública - Sector Educación                                  ",4,"PUNO","Urbana"]
[452,"PUNO","ALTO SANTA ROSA","3870423","I.E.N.  - NIÑO JESUSITO","I.E.N.","Educación Básica Regular      ","A1  - Pública - Sector Educación                                  ",7,"PUNO","Urbana"]
[453,"PUNO","PUNO","3884995","I.E.N.  - NIÑO DE LA ESTRELLA","I.E.N.","Educación Básica Regular      ","A1  - Pública - Sector Educación                                  ",7,"PUNO","Urbana"]
[454,"PUNO","LLAVINI","3922319","I.E.N.  - NIÑOS DE JESUS","I.E.N.","Educación Básica Regular      ","A1  - Pública - Sector Educación                                  ",7,"PUNO","Urbana"]
[455,"PUNO","8 DE OCTUBRE","3922320","I.E.N.  - LAS SEMILLITAS DE JESUS","I.E.N.","Educación Básica Regular      ","A1  - Pública - Sector Educación                                  ",8,"PUNO","Urbana"]
[456,"PUNO","HUERTA HUARAYA","3922321","I.E.N.  - BEBY GENIOS","I.E.N.","Educación Básica Regular      ","A1  - Pública - Sector Educación                                  ",8,"PUNO","Rural"]
[457,"PUNO","JAYLLIHUAYA","3922322","I.E.N.  - NIÑOS INDIGOS","I.E.N.","Educación Básica Regular      ","A1  - Pública - Sector Educación                                  ",10,"PUNO","Urbana"]
[458,"PUNO","RICARDO PALMA","3922323","I.E.N.  - NUEVO HORIZONTE","I.E.N.","Educación Básica Regular      ","A1  - Pública - Sector Educación                                  ",8,"PUNO","Urbana"]
[459,"PUNO","RICARDO PALMA","3922324","I.E.N.  - CASITA DEL SABER","I.E.N.","Educación Básica Regular      ","A1  - Pública - Sector Educación                                  ",12,"PUNO","Urbana"]
[460,"PUNO","SANTA ROSA","3922326","I.E.N.  - JORGE CHAVEZ","I.E.N.","Educación Básica Regular      ","A1  - Pública - Sector Educación                                  ",8,"PUNO","Urbana"]
[461,"PUNO","MANTO","3922327","I.E.N.  - SAN MIGUEL","I.E.N.","Educación Básica Regular      ","A1  - Pública - Sector Educación                                  ",8,"PUNO","Urbana"]
[462,"PUNO","RICARDO PALMA","3922328","I.E.N.  - LOS CLAVELITOS","I.E.N.","Educación Básica Regular      ","A1  - Pública - Sector Educación                                  ",10,"PUNO","Urbana"]
[463,"PUNO","MANTO","3922329","I.E.N.  - NUBE LUZ","I.E.N.","Educación Básica Regular      ","A1  - Pública - Sector Educación                                  ",6,"PUNO","Urbana"]
[464,"PUNO","MANTO NORTE","3922310","I.E.N.  - ALTO SAN MARTIN","I.E.N.","Educación Básica Regular      ","A1  - Pública - Sector Educación                                  ",8,"PUNO","Urbana"]
[465,"PUNO","BELLAVISTA","3922311","I.E.N.  - ALTO BELLAVISTA","I.E.N.","Educación Básica Regular      ","A1  - Pública - Sector Educación                                  ",9,"PUNO","Urbana"]
[466,"PUNO","RICARDO PALMA","3922312","I.E.N.  - NUEVA ALBORADA","I.E.N.","Educación Básica Regular      ","A1  - Pública - Sector Educación                                  ",8,"PUNO","Urbana"]
[467,"PUNO","BELLAVISTA","3924642","I.E.N.  - PALMERITAS","I.E.N.","Educación Básica Regular      ","A1  - Pública - Sector Educación                                  ",16,{"$f":"+B642","v":"PUNO"},"Urbana"]
[468,"PUNO","RICARDO PALMA","3924643","I.E.N.  - EL MUNDO DE LOS NIÑOS","I.E.N.","Educación Básica Regular      ","A1  - Pública - Sector Educación                                  ",9,"PUNO","Urbana"]
[469,"PUNO","SALCEDO","3916575","I.E.N.  - SAN JUANITO","I.E.N.","Educación Básica Regular      ","A1  - Pública - Sector Educación                                  ",16,"PUNO","Urbana"]
[470,"PUNO","MIRAFLORES","3916563","I.E.N.  - MIS PEQUEÑOS ANGELITOS","I.E.N.","Educación Básica Regular      ","A1  - Pública - Sector Educación                                  ",8,"PUNO","Urbana"]
[471,"PUNO","HUERTA HUARAYA","3916572","I.E.N.  - HUERTA HUARAYA","I.E.N.","Educación Básica Regular      ","A1  - Pública - Sector Educación                                  ",6,"PUNO","Rural"]
[472,"PUNO","HACIENDA COLLACACHI","0229633","I.E.I.  - 203","I.E.I.","Educación Básica Regular      ","A1  - Pública - Sector Educación                                  ",7,"PUNO","Rural"]
[480,"PUNO","ALTO SANTA ROSA","0114332","I.E.N.  - ALTO SANTA ROSA","I.E.N.","Educación Básica Regular      ","A1  - Pública - Sector Educación                                  ",6,"PUNO","Urbana"]
[481,"PUNO","PUNO","0114341","I.E.N.  - ALTO MAÑAZO","I.E.N.","Educación Básica Regular      ","A1  - Pública - Sector Educación                                  ",8,"PUNO","Urbana"]
[482,"PUNO","PUNO","0114342","I.E.N.  - MAÑAZO","I.E.N.","Educación Básica Regular      ","A1  - Pública - Sector Educación                                  ",8,"PUNO","Urbana"]
[483,"PUNO","PUNO","0114343","I.E.N.  - CHANU CHANU","I.E.N.","Educación Básica Regular      ","A1  - Pública - Sector Educación                                  ",10,"PUNO","Urbana"]
[484,"PUNO","SALCEDO","0114344","I.E.N.  - SALCEDO TEPRO","I.E.N.","Educación Básica Regular      ","A1  - Pública - Sector Educación                                  ",7,"PUNO","Urbana"]
[485,"PUNO","PUNO","0114345","I.E.N.  - UNION SANTA ROSA","I.E.N.","Educación Básica Regular      ","A1  - Pública - Sector Educación                                  ",9,"PUNO","Urbana"]
[488,"PUNO","UROS CHULLUNI","0539353","I.E.I.  - 264","I.E.I.","Educación Básica Regular      ","A1  - Pública - Sector Educación                                  ",55,"PUNO","Rural"]
[490,"PUNO","CHIMU","0520130","I.E.I.  - 253","I.E.I.","Educación Básica Regular      ","A1  - Pública - Sector Educación                                  ",8,"PUNO","Rural"]
[491,"PUNO","CHANU CHANU ETAPA 1","0506832","I.E.I.  - 254","I.E.I.","Educación Básica Regular      ","A1  - Pública - Sector Educación                                  ",21,"PUNO","Urbana"]
[492,"PUNO","CIUDAD UNIVERSITARIA","0506931","I.E.I.  - 252","I.E.I.","Educación Básica Regular      ","A1  - Pública - Sector Educación                                  ",119,"PUNO","Urbana"]
[493,"PUNO","ICHU","0548610","I.E.I.  - 249","I.E.I.","Educación Básica Regular      ","A1  - Pública - Sector Educación                                  ",7,"PUNO","Rural"]
[495,"PUNO","BELLAVISTA","0574913","I.E.I.  - 270","I.E.I.","Educación Básica Regular      ","A1  - Pública - Sector Educación                                  ",131,"PUNO","Urbana"]
[500,"PUNO","PORTEÑO","0706507","I.E.I.  - 285 GRAN UNIDAD ESCOLAR SAN CARLOS","I.E.I.","Educación Básica Regular      ","A1  - Pública - Sector Educación                                  ",236,"PUNO","Urbana"]
[503,"PUNO","SANTIAGO CHEJONA","0618389","I.E.I.  - 276","I.E.I.","Educación Básica Regular      ","A1  - Pública - Sector Educación                                  ",76,"PUNO","Urbana"]
[507,"PUNO","SALCEDO","1154426","I.E.I.  - 332","I.E.I.","Educación Básica Regular      ","A1  - Pública - Sector Educación                                  ",21,"PUNO","Urbana"]
[510,"PUNO","LOS ANDES","1023357","I.E.I.  - 325","I.E.I.","Educación Básica Regular      ","A1  - Pública - Sector Educación                                  ",23,"PUNO","Urbana"]
[513,"PUNO","VICTORIA","1023399","I.E.I.  - 326 MANUEL NUÑEZ BUTRON","I.E.I.","Educación Básica Regular      ","A1  - Pública - Sector Educación                                  ",177,"PUNO","Urbana"]
[515,"PUNO","SALCEDO","1023191","I.E.I.  - 288","I.E.I.","Educación Básica Regular      ","A1  - Pública - Sector Educación                                  ",28,"PUNO","Urbana"]
[516,"PUNO","PUNO","1470970","I.E.I.  - 1190 ESTRELLITAS DEL SABER","I.E.I.","Educación Básica Regular      ","A1  - Pública - Sector Educación                                  ",67,"PUNO","Urbana"]
[517,"PUNO","PUNO","1525591","I.E.I.  - 1203 PASITOS DE ORO","I.E.I.","Educación Básica Regular      ","A1  - Pública - Sector Educación                                  ",96,"PUNO","Urbana"]
[518,"PUNO","ISLA TUPIRI","1540210","I.E.I.  - 1205","I.E.I.","Educación Básica Regular      ","A1  - Pública - Sector Educación                                  ",22,"PUNO","Rural"]
[519,"SAN ANTONIO","JUNCAL","3886720","I.E.N.  - ANGELITOS DEL ANDE","I.E.N.","Educación Básica Regular      ","A1  - Pública - Sector Educación                                  ",10,"SAN ANTONIO","Urbana"]
[520,"SAN ANTONIO","CACHIPASCANA","3870424","I.E.N.  - CACHIPASCANA","I.E.N.","Educación Básica Regular      ","A1  - Pública - Sector Educación                                  ",7,"SAN ANTONIO","Rural"]
[521,"SAN ANTONIO","CRUZANI","3870450","I.E.N.  - CRUZANI","I.E.N.","Educación Básica Regular      ","A1  - Pública - Sector Educación                                  ",6,"SAN ANTONIO","Rural"]
[522,"SAN ANTONIO","KOMERUCHO","3870451","I.E.N.  - KOMERUCHO","I.E.N.","Educación Básica Regular      ","A1  - Pública - Sector Educación                                  ",7,"SAN ANTONIO","Rural"]
[523,"SAN ANTONIO","JESUS MARIA","2043908","I.E.N.  - JESUS MARIA","I.E.N.","Educación Básica Regular      ","A1  - Pública - Sector Educación                                  ",3,"SAN ANTONIO","Rural"]
[524,"SAN ANTONIO","KOMERUCHO","1621622","I.E.I.  - 1280 AGUILAS DEL SABER","I.E.I.","Educación Básica Regular      ","A1  - Pública - Sector Educación                                  ",9,"SAN ANTONIO","Rural"]
[525,"SAN ANTONIO","CACHIPASCANA","1621432","I.E.I.  - 1263 SAN JOSE","I.E.I.","Educación Básica Regular      ","A1  - Pública - Sector Educación                                  ",5,"SAN ANTONIO","Rural"]
[526,"SAN ANTONIO","CRUZANI","3922316","I.E.N.  - HUALLATITAS","I.E.N.","Educación Básica Regular      ","A1  - Pública - Sector Educación                                  ",3,"SAN ANTONIO","Rural"]
[527,"SAN ANTONIO","JUNCAL","1345289","I.E.I.  - 240","I.E.I.","Educación Básica Regular      ","A1  - Pública - Sector Educación                                  ",13,"SAN ANTONIO","Urbana"]
[528,"TIQUILLACA","CHILA","1621259","I.E.I.  - 1245 DIVINO NIÑO SAN SALVADOR","I.E.I.","Educación Básica Regular      ","A1  - Pública - Sector Educación                                  ",8,"TIQUILLACA","Rural"]
[529,"TIQUILLACA","CONDORIRI","1655034","I.E.I.  - 1306 NUEVA VISION","I.E.I.","Educación Básica Regular      ","A1  - Pública - Sector Educación                                  ",6,"TIQUILLACA","Rural"]
[530,"TIQUILLACA","HACIENDA CHINGARANE","2043227","I.E.N.  - CHINGARANI","I.E.N.","Educación Básica Regular      ","A1  - Pública - Sector Educación                                  ",3,"TIQUILLACA","Rural"]
[531,"TIQUILLACA","CECCECANI","2043220","I.E.N.  - CECCECANI","I.E.N.","Educación Básica Regular      ","A1  - Pública - Sector Educación                                  ",2,"TIQUILLACA","Rural"]
[532,"TIQUILLACA","KATACHILLA","2043221","I.E.N.  - CHUSAMARCA","I.E.N.","Educación Básica Regular      ","A1  - Pública - Sector Educación                                  ",5,"TIQUILLACA","Rural"]
[533,"TIQUILLACA","PAXA","2043223","I.E.N.  - CHACOMOKO","I.E.N.","Educación Básica Regular      ","A1  - Pública - Sector Educación                                  ",3,"TIQUILLACA","Rural"]
[534,"TIQUILLACA","CONDORIRI","2043225","I.E.N.  - CONDORIRI","I.E.N.","Educación Básica Regular      ","A1  - Pública - Sector Educación                                  ",2,"TIQUILLACA","Rural"]
[535,"TIQUILLACA","TICUYO","2043202","I.E.N.  - TICUYO","I.E.N.","Educación Básica Regular      ","A1  - Pública - Sector Educación                                  ",3,"TIQUILLACA","Rural"]
[536,"TIQUILLACA","PACSA","2043207","I.E.N.  - PAXA","I.E.N.","Educación Básica Regular      ","A1  - Pública - Sector Educación                                  ",4,"TIQUILLACA","Rural"]
[537,"TIQUILLACA","ARBOLEDA","2043208","I.E.N.  - ARBOLEDA","I.E.N.","Educación Básica Regular      ","A1  - Pública - Sector Educación                                  ",3,"TIQUILLACA","Rural"]
[538,"TIQUILLACA","TIQUILLACA","0229708","I.E.I.  - 210","I.E.I.","Educación Básica Regular      ","A1  - Pública - Sector Educación                                  ",12,"TIQUILLACA","Urbana"]
[539,"VILQUE","SAN IGNACIO","2042407","I.E.N.  - SAN IGNACIO","I.E.N.","Educación Básica Regular      ","A1  - Pública - Sector Educación                                  ",4,"VILQUE","Rural"]
[540,"VILQUE","POSTA","2042415","I.E.N.  - POSTA","I.E.N.","Educación Básica Regular      ","A1  - Pública - Sector Educación                                  ",5,"VILQUE","Rural"]
[541,"VILQUE","AGUA BUENA","2042418","I.E.N.  - AGUA BUENA","I.E.N.","Educación Básica Regular      ","A1  - Pública - Sector Educación                                  ",2,"VILQUE","Rural"]
[542,"VILQUE","PHESCACHA","2042421","I.E.N.  - PHESCACHA","I.E.N.","Educación Básica Regular      ","A1  - Pública - Sector Educación                                  ",1,"VILQUE","Rural"]
[543,"VILQUE","SAN JUAN DE MACHACMARCA","2042423","I.E.N.  - SAN JUAN","I.E.N.","Educación Básica Regular      ","A1  - Pública - Sector Educación                                  ",10,"VILQUE","Rural"]
[544,"VILQUE","TICUYO","2042425","I.E.N.  - TICUYO","I.E.N.","Educación Básica Regular      ","A1  - Pública - Sector Educación                                  ",4,"VILQUE","Rural"]
[545,"VILQUE","CCOACCASE / COAJASI","2042428","I.E.N.  - COAJASI","I.E.N.","Educación Básica Regular      ","A1  - Pública - Sector Educación                                  ",4,"VILQUE","Rural"]
[546,"VILQUE","MACHACMARCA","1621341","I.E.I.  - 1254 SEMILLITAS DE JESUS","I.E.I.","Educación Básica Regular      ","A1  - Pública - Sector Educación                                  ",13,"VILQUE","Rural"]
[547,"VILQUE","COTAÑA","1621200","I.E.I.  - 1240 NIÑO JESUS","I.E.I.","Educación Básica Regular      ","A1  - Pública - Sector Educación                                  ",12,"VILQUE","Rural"]
[548,"VILQUE","HUANCASAYA","1621135","I.E.I.  - 1233 NIÑO JESUSITO","I.E.I.","Educación Básica Regular      ","A1  - Pública - Sector Educación                                  ",7,"VILQUE","Rural"]
[549,"VILQUE","HACIENDA CAIRANE","1621440","I.E.I.  - 1264 LOS ANGELITOS DE CAIRANI","I.E.I.","Educación Básica Regular      ","A1  - Pública - Sector Educación                                  ",4,"VILQUE","Rural"]
[550,"VILQUE","YANARICO","1621515","I.E.I.  - 1271 EXALTACION-YANARICO","I.E.I.","Educación Básica Regular      ","A1  - Pública - Sector Educación                                  ",7,"VILQUE","Rural"]
[551,"VILQUE","ULLAGACHI","1621598","I.E.I.  - 1278 LA SAGRADA FAMILIA","I.E.I.","Educación Básica Regular      ","A1  - Pública - Sector Educación                                  ",4,"VILQUE","Rural"]
[552,"VILQUE","AZUL CANCHA","1621705","I.E.I.  - 1288 RAYITO AZUL","I.E.I.","Educación Básica Regular      ","A1  - Pública - Sector Educación                                  ",5,"VILQUE","Rural"]
[553,"VILQUE","MACHACMARCA","3886719","I.E.N.  - SAN MATEO","I.E.N.","Educación Básica Regular      ","A1  - Pública - Sector Educación                                  ",13,"VILQUE","Rural"]
[554,"VILQUE","SUYANA","3917324","I.E.N.  - LA CASITA FELIZ","I.E.N.","Educación Básica Regular      ","A1  - Pública - Sector Educación                                  ",7,"VILQUE","Rural"]
[558,"PAUCARCOLLA","ANTONIANI","0230698","I.E.P.   - 70061","I.E.P. ","Educación Básica Regular      ","A1  - Pública - Sector Educación                                  ",11,"PAUCARCOLLA","Rural"]
[560,"PAUCARCOLLA","YANICO / TITILE","0230615","I.E.P.   - 70053","I.E.P. ","Educación Básica Regular      ","A1  - Pública - Sector Educación                                  ",17,{"$f":"+B706","v":"PAUCARCOLLA"},"Rural"]
[571,"CAPACHICA","HILATA","0230565","I.E.P.   - 70046","I.E.P. ","Educación Básica Regular      ","A1  - Pública - Sector Educación                                  ",33,"CAPACHICA","Rural"]
[574,"HUATA","CHINCHERPAMPA","0230631","I.E.P.   - 70055 CESAR VALLEJO","I.E.P. ","Educación Básica Regular      ","A1  - Pública - Sector Educación                                  ",5,"HUATA","Rural"]
[576,"HUATA","FAON","0230797","I.E.P.   - 70071","I.E.P. ","Educación Básica Regular      ","A1  - Pública - Sector Educación                                  ",5,"HUATA","Rural"]
[578,"VILQUE","COTAÑA","0546911","I.E.P.   - 70734","I.E.P. ","Educación Básica Regular      ","A1  - Pública - Sector Educación                                  ",28,"VILQUE","Rural"]
[579,"VILQUE","HACIENDA CAIRANE","0226985","I.E.P.   - 70711","I.E.P. ","Educación Básica Regular      ","A1  - Pública - Sector Educación                                  ",5,"VILQUE","Rural"]
[581,"VILQUE","ULLAGACHI","0230680","I.E.P.   - 70060","I.E.P. ","Educación Básica Regular      ","A1  - Pública - Sector Educación                                  ",3,"VILQUE","Rural"]
[582,"VILQUE","YANARICO","0239038","I.E.P.   - 70733","I.E.P. ","Educación Básica Regular      ","A1  - Pública - Sector Educación                                  ",16,"VILQUE","Rural"]
[587,"PUNO","PUNO","0243972","I.E.P.   - 71013 GLORIOSO SAN CARLOS","I.E.P. ","Educación Básica Regular      ","A1  - Pública - Sector Educación                                  ",1063,"PUNO","Urbana"]
[592,"PUNO","UROS TORANI PATA","0227421","I.E.P.   - 70682","I.E.P. ","Educación Básica Regular      ","A1  - Pública - Sector Educación                                  ",27,"PUNO","Rural"]
[595,"PUNO","CANCHARANI","0231712","I.E.P.   - 70164","I.E.P. ","Educación Básica Regular      ","A1  - Pública - Sector Educación                                  ",17,"PUNO","Urbana"]
[599,"PUNO","HUERTA HUARAYA","0230532","I.E.P.   - 70043","I.E.P. ","Educación Básica Regular      ","A1  - Pública - Sector Educación                                  ",6,"PUNO","Rural"]
[600,"PUNO","HACIENDA COLLACACHI","0239079","I.E.P.   - 70729","I.E.P. ","Educación Básica Regular      ","A1  - Pública - Sector Educación                                  ",19,"PUNO","Rural"]
[607,"PUNO","YANAMAYO","0230599","I.E.P.   - 70051","I.E.P. ","Educación Básica Regular      ","A1  - Pública - Sector Educación                                  ",5,"PUNO","Rural"]
[609,"PUNO","PUNO","0230573","I.E.P.   - 70047","I.E.P. ","Educación Básica Regular      ","A1  - Pública - Sector Educación                                  ",150,"PUNO","Urbana"]
[611,"PUNO","CHULLUNE","0243840","I.E.P.   - 70620","I.E.P. ","Educación Básica Regular      ","A1  - Pública - Sector Educación                                  ",58,"PUNO","Rural"]
[612,"PUNO","PUNO","0230391","I.E.P.   - 70029 MARIA AUXILIADORA","I.E.P. ","Educación Básica Regular      ","A1  - Pública - Sector Educación                                  ",862,"PUNO","Urbana"]
[613,"PUNO","ISLA CCAPI LOS UROS","0230607","I.E.P.   - 70052","I.E.P. ","Educación Básica Regular      ","A1  - Pública - Sector Educación                                  ",42,"PUNO","Rural"]
[616,"PUNO","SALCEDO","1154459","I.E.P.   - 70808","I.E.P. ","Educación Básica Regular      ","A1  - Pública - Sector Educación                                  ",172,"PUNO","Urbana"]
[618,"PUNO","KAPI GRANDE","1025766","I.E.P.   - 70802","I.E.P. ","Educación Básica Regular      ","A1  - Pública - Sector Educación                                  ",7,"PUNO","Rural"]
[620,"PUNO","TRIBUNA","1023753","I.E.P.   - 70726","I.E.P. ","Educación Básica Regular      ","A1  - Pública - Sector Educación                                  ",7,"PUNO","Rural"]
[622,"PUNO","CHIARAQUE","1029958","I.E.P.   - 70806","I.E.P. ","Educación Básica Regular      ","A1  - Pública - Sector Educación                                  ",3,"PUNO","Rural"]
[626,"ATUNCOLLA","ANANSAYA","0804351","I.E.P.   - 70708","I.E.P. ","Educación Básica Regular      ","A1  - Pública - Sector Educación                                  ",27,"ATUNCOLLA","Rural"]
[627,"ATUNCOLLA","HACIENDA UMAYO","0546713","I.E.P.   - 70706","I.E.P. ","Educación Básica Regular      ","A1  - Pública - Sector Educación                                  ",11,"ATUNCOLLA","Rural"]
[629,"ATUNCOLLA","ULLAGACHI","0242248","I.E.P.   - 70716","I.E.P. ","Educación Básica Regular      ","A1  - Pública - Sector Educación                                  ",35,"ATUNCOLLA","Rural"]
[631,"ATUNCOLLA","LLUNGO","0239061","I.E.P.   - 70715","I.E.P. ","Educación Básica Regular      ","A1  - Pública - Sector Educación                                  ",96,"ATUNCOLLA","Rural"]
[636,"ACORA","YANAPATA","0531483","I.E.P.   - 70727","I.E.P. ","Educación Básica Regular      ","A1  - Pública - Sector Educación                                  ",7,"ACORA","Rural"]
[640,"PICHACANI","SOQUESANI","0231209","I.E.P.   - 70113","I.E.P. ","Educación Básica Regular      ","A1  - Pública - Sector Educación                                  ",43,"PICHACANI","Rural"]
[641,"ACORA","CHAJANA","0660308","I.E.P.   - 70713","I.E.P. ","Educación Básica Regular      ","A1  - Pública - Sector Educación                                  ",17,"ACORA","Rural"]
[643,"ACORA","JILATAMARCA","0660324","I.E.P.   - 70695","I.E.P. ","Educación Básica Regular      ","A1  - Pública - Sector Educación                                  ",18,"ACORA","Rural"]
[644,"ACORA","CANCATANI","0706598","I.E.P.   - 70735","I.E.P. ","Educación Básica Regular      ","A1  - Pública - Sector Educación                                  ",1,"ACORA","Rural"]
[648,"ACORA","HACIENDA SAN FERNANDO","0530105","I.E.P.   - 70723","I.E.P. ","Educación Básica Regular      ","A1  - Pública - Sector Educación                                  ",2,"ACORA","Rural"]
[649,"ACORA","IRPAPAMPA","0531996","I.E.P.   - 70653","I.E.P. ","Educación Básica Regular      ","A1  - Pública - Sector Educación                                  ",0,"ACORA","Rural"]
[650,"ACORA","HUANTACACHI CHILA","0243816","I.E.P.   - 70616","I.E.P. ","Educación Básica Regular      ","A1  - Pública - Sector Educación                                  ",25,"ACORA","Rural"]
[651,"ACORA","SOCCA","0231266","I.E.P.   - 70119","I.E.P. ","Educación Básica Regular      ","A1  - Pública - Sector Educación                                  ",45,"ACORA","Rural"]
[652,"ACORA","QUENAFAJA","0231134","I.E.P.   - 70106","I.E.P. ","Educación Básica Regular      ","A1  - Pública - Sector Educación                                  ",16,"ACORA","Rural"]
[653,"ACORA","CCOPAMAYA","0231530","I.E.P.   - 70146","I.E.P. ","Educación Básica Regular      ","A1  - Pública - Sector Educación                                  ",24,"ACORA","Rural"]
[655,"ACORA","COLLINI","0231498","I.E.P.   - 70142 MARIA INMACULADA CONCEPCION","I.E.P. ","Educación Básica Regular      ","A1  - Pública - Sector Educación                                  ",38,"ACORA","Rural"]
[656,"PICHACANI","HACIENDA VILUYO","0239384","I.E.P.   - 70727","I.E.P. ","Educación Básica Regular      ","A1  - Pública - Sector Educación                                  ",18,"PICHACANI","Rural"]
[657,"PICHACANI","TOLAMARCA","0231589","I.E.P.   - 70151","I.E.P. ","Educación Básica Regular      ","A1  - Pública - Sector Educación                                  ",6,"PICHACANI","Rural"]
[658,"PICHACANI","CATAHUI","0474346","I.E.P.   - 70651","I.E.P. ","Educación Básica Regular      ","A1  - Pública - Sector Educación                                  ",5,"PICHACANI","Rural"]
[659,"PICHACANI","MOROCOLLO","0530006","I.E.P.   - 70691","I.E.P. ","Educación Básica Regular      ","A1  - Pública - Sector Educación                                  ",1,"PICHACANI","Rural"]
[662,"PICHACANI","TUNQUIPA","0631374","I.E.P.   - 70698","I.E.P. ","Educación Básica Regular      ","A1  - Pública - Sector Educación                                  ",19,"PICHACANI","Rural"]
[664,"ACORA","CCOPAYA","0231456","I.E.P.   - 70138","I.E.P. ","Educación Básica Regular      ","A1  - Pública - Sector Educación                                  ",27,"ACORA","Urbana"]
[665,"ACORA","THUNCO","0231464","I.E.P.   - 70139","I.E.P. ","Educación Básica Regular      ","A1  - Pública - Sector Educación                                  ",46,"ACORA","Rural"]
[666,"ACORA","MARCA ESQUEÑA","0231050","I.E.P.   - 70098","I.E.P. ","Educación Básica Regular      ","A1  - Pública - Sector Educación                                  ",16,"ACORA","Rural"]
[667,"ACORA","MOLINO","0239376","I.E.P.   - 70721","I.E.P. ","Educación Básica Regular      ","A1  - Pública - Sector Educación                                  ",13,"ACORA","Rural"]
[669,"ACORA","SANTA ROSA","0230946","I.E.P.   - 70087","I.E.P. ","Educación Básica Regular      ","A1  - Pública - Sector Educación                                  ",11,"ACORA","Rural"]
[670,"ACORA","THUNUHUAYA","0231258","I.E.P.   - 70118","I.E.P. ","Educación Básica Regular      ","A1  - Pública - Sector Educación                                  ",19,"ACORA","Rural"]
[671,"ACORA","CARUMAS","0231753","I.E.P.   - 70168","I.E.P. ","Educación Básica Regular      ","A1  - Pública - Sector Educación                                  ",27,"ACORA","Rural"]
[672,"ACORA","JAYU JAYU","0231191","I.E.P.   - 70112","I.E.P. ","Educación Básica Regular      ","A1  - Pública - Sector Educación                                  ",27,"ACORA","Urbana"]
[673,"ACORA","IMATA","0239368","I.E.P.   - 70720","I.E.P. ","Educación Básica Regular      ","A1  - Pública - Sector Educación                                  ",28,"ACORA","Rural"]
[675,"PICHACANI","JATUCACHI","0706606","I.E.P.   - 70724","I.E.P. ","Educación Básica Regular      ","A1  - Pública - Sector Educación                                  ",2,"PICHACANI","Rural"]
[676,"TIQUILLACA","CHACO","0660266","I.E.P.   - 70701","I.E.P. ","Educación Básica Regular      ","A1  - Pública - Sector Educación                                  ",2,"TIQUILLACA","Rural"]
[680,"ACORA","CULTA","0231290","I.E.P.   - 70122","I.E.P. ","Educación Básica Regular      ","A1  - Pública - Sector Educación                                  ",58,"ACORA","Rural"]
[681,"ACORA","JACHA HUINCHOCA","0231522","I.E.P.   - 70145","I.E.P. ","Educación Básica Regular      ","A1  - Pública - Sector Educación                                  ",23,"ACORA","Rural"]
[683,"TIQUILLACA","CECCECANI","0487330","I.E.P.   - 70700","I.E.P. ","Educación Básica Regular      ","A1  - Pública - Sector Educación                                  ",2,"TIQUILLACA","Rural"]
[684,"TIQUILLACA","TIQUILLACA","0230177","I.E.P.   - 70007","I.E.P. ","Educación Básica Regular      ","A1  - Pública - Sector Educación                                  ",60,"TIQUILLACA","Urbana"]
[685,"TIQUILLACA","CONDORIRI","0230714","I.E.P.   - 70063","I.E.P. ","Educación Básica Regular      ","A1  - Pública - Sector Educación                                  ",13,"TIQUILLACA","Rural"]
[686,"ACORA","CARITAMAYA","0231233","I.E.P.   - 70116","I.E.P. ","Educación Básica Regular      ","A1  - Pública - Sector Educación                                  ",60,"ACORA","Urbana"]
[687,"ACORA","CUCHO ESQUEÑA","0230912","I.E.P.   - 70084","I.E.P. ","Educación Básica Regular      ","A1  - Pública - Sector Educación                                  ",46,"ACORA","Rural"]
[688,"ACORA","MOLLOCO","0231431","I.E.P.   - 70136","I.E.P. ","Educación Básica Regular      ","A1  - Pública - Sector Educación                                  ",30,"ACORA","Rural"]
[689,"ACORA","JUROHUANANI","0231449","I.E.P.   - 70137","I.E.P. ","Educación Básica Regular      ","A1  - Pública - Sector Educación                                  ",4,"ACORA","Rural"]
[690,"ACORA","HUAÑASCURO","0231001","I.E.P.   - 70093","I.E.P. ","Educación Básica Regular      ","A1  - Pública - Sector Educación                                  ",17,"ACORA","Rural"]
[694,"ACORA","COCOSANI","0231548","I.E.P.   - 70147","I.E.P. ","Educación Básica Regular      ","A1  - Pública - Sector Educación                                  ",14,{"$f":"+B770","v":"ACORA"},"Rural"]
[697,"ACORA","TANAPACA","0231076","I.E.P.   - 70100","I.E.P. ","Educación Básica Regular      ","A1  - Pública - Sector Educación                                  ",16,"ACORA","Rural"]
[699,"ACORA","ISCATA","0231654","I.E.P.   - 70158","I.E.P. ","Educación Básica Regular      ","A1  - Pública - Sector Educación                                  ",22,"ACORA","Rural"]
[701,"ACORA","ISCAHUINCHOCA","0231084","I.E.P.   - 70101","I.E.P. ","Educación Básica Regular      ","A1  - Pública - Sector Educación                                  ",17,"ACORA","Rural"]
[703,"ACORA","CHAMCHILLA","0231555","I.E.P.   - 70148","I.E.P. ","Educación Básica Regular      ","A1  - Pública - Sector Educación                                  ",20,"ACORA","Rural"]
[704,"ACORA","CHANCACHI","0231340","I.E.P.   - 70127","I.E.P. ","Educación Básica Regular      ","A1  - Pública - Sector Educación                                  ",22,"ACORA","Rural"]
[706,"ACORA","CHALLOCOLLO","0231506","I.E.P.   - 70143","I.E.P. ","Educación Básica Regular      ","A1  - Pública - Sector Educación                                  ",11,"ACORA","Urbana"]
[707,"ACORA","TARUCAMARCA","0231761","I.E.P.   - 70169","I.E.P. ","Educación Básica Regular      ","A1  - Pública - Sector Educación                                  ",2,"ACORA","Rural"]
[711,"ACORA","AGUAS CALIENTES","1572536","I.E.P.   - 70756","I.E.P. ","Educación Básica Regular      ","A1  - Pública - Sector Educación                                  ",13,"ACORA","Rural"]
[712,"AMANTANI","OCCOSUYO","0230664","I.E.P.   - 70058 FRANCISCO BOLOGNESI","I.E.P. ","Educación Básica Regular      ","A1  - Pública - Sector Educación                                  ",40,"AMANTANI","Rural"]
[713,"AMANTANI","SANCAYUNI","0230185","I.E.P.   - 70008","I.E.P. ","Educación Básica Regular      ","A1  - Pública - Sector Educación                                  ",26,"AMANTANI","Rural"]
[714,"AMANTANI","TAQUILE","0230128","I.E.P.   - 70002 NUESTRA SEÑORA DE LOS CAMPOS","I.E.P. ","Educación Básica Regular      ","A1  - Pública - Sector Educación                                  ",139,"AMANTANI","Rural"]
[715,"AMANTANI","AMANTANI","0230474","I.E.P.   - 70037 VIRGEN DE LAS MERCEDES","I.E.P. ","Educación Básica Regular      ","A1  - Pública - Sector Educación                                  ",101,"AMANTANI","Urbana"]
[716,"CHUCUITO","POTOJANI GRANDE","0231183","I.E.P.   - 70111","I.E.P. ","Educación Básica Regular      ","A1  - Pública - Sector Educación                                  ",53,"CHUCUITO","Rural"]
[717,"CHUCUITO","CHINCHERA","0231282","I.E.P.   - 70121","I.E.P. ","Educación Básica Regular      ","A1  - Pública - Sector Educación                                  ",2,"CHUCUITO","Urbana"]
[720,"CHUCUITO","CARINA","0231720","I.E.P.   - 70165","I.E.P. ","Educación Básica Regular      ","A1  - Pública - Sector Educación                                  ",18,"CHUCUITO","Rural"]
[721,"CHUCUITO","TACASAYA","0230938","I.E.P.   - 70086","I.E.P. ","Educación Básica Regular      ","A1  - Pública - Sector Educación                                  ",14,"CHUCUITO","Rural"]
[722,"CHUCUITO","PUCANI","0231324","I.E.P.   - 70125","I.E.P. ","Educación Básica Regular      ","A1  - Pública - Sector Educación                                  ",7,"CHUCUITO","Rural"]
[724,"CHUCUITO","COCHIRAYA","0231035","I.E.P.   - 70096","I.E.P. ","Educación Básica Regular      ","A1  - Pública - Sector Educación                                  ",29,"CHUCUITO","Rural"]
[725,"CHUCUITO","PARINA","0231308","I.E.P.   - 70123","I.E.P. ","Educación Básica Regular      ","A1  - Pública - Sector Educación                                  ",32,"CHUCUITO","Urbana"]
[726,"CHUCUITO","LUQUINA CHICO","0231274","I.E.P.   - 70120","I.E.P. ","Educación Básica Regular      ","A1  - Pública - Sector Educación                                  ",24,"CHUCUITO","Rural"]
[727,"CHUCUITO","CHURO","0231241","I.E.P.   - 70117","I.E.P. ","Educación Básica Regular      ","A1  - Pública - Sector Educación                                  ",46,"CHUCUITO","Rural"]
[728,"CHUCUITO","INCHUPALLA","0231415","I.E.P.   - 70134 JOSE ANTONIO ENCINAS","I.E.P. ","Educación Básica Regular      ","A1  - Pública - Sector Educación                                  ",18,"CHUCUITO","Rural"]
[729,"CHUCUITO","LUQUINA GRANDE","0845503","I.E.P.   - 70694","I.E.P. ","Educación Básica Regular      ","A1  - Pública - Sector Educación                                  ",19,"CHUCUITO","Rural"]
[730,"MAÑAZO","QUEMILLUNI","0243758","I.E.P.   - 70606","I.E.P. ","Educación Básica Regular      ","A1  - Pública - Sector Educación                                  ",8,"MAÑAZO","Rural"]
[731,"MAÑAZO","COPANI DEL ROSARIO","0242255","I.E.P.   - 70804","I.E.P. ","Educación Básica Regular      ","A1  - Pública - Sector Educación                                  ",17,"MAÑAZO","Rural"]
[734,"MAÑAZO","CONAVIRI","0242263","I.E.P.   - 70730","I.E.P. ","Educación Básica Regular      ","A1  - Pública - Sector Educación                                  ",14,"MAÑAZO","Rural"]
[738,"MAÑAZO","ANDAMARCA","0804534","I.E.P.   - 70703","I.E.P. ","Educación Básica Regular      ","A1  - Pública - Sector Educación                                  ",7,"MAÑAZO","Rural"]
[740,"SAN ANTONIO","LLANQUERI","0631366","I.E.P.   - 70688","I.E.P. ","Educación Básica Regular      ","A1  - Pública - Sector Educación                                  ",4,"SAN ANTONIO","Rural"]
[742,"SAN ANTONIO","JUNCAL","0230706","I.E.P.   - 70062","I.E.P. ","Educación Básica Regular      ","A1  - Pública - Sector Educación                                  ",55,"SAN ANTONIO","Urbana"]
[744,"SAN ANTONIO","KOMERUCHO","0515940","I.E.P.   - 70699","I.E.P. ","Educación Básica Regular      ","A1  - Pública - Sector Educación                                  ",13,"SAN ANTONIO","Rural"]
[745,"COATA","SAMUCHACA","0631309","I.E.P.   - 70705","I.E.P. ","Educación Básica Regular      ","A1  - Pública - Sector Educación                                  ",14,"COATA","Rural"]
[749,"COATA","SANTA CRUZ DE CAPARA","0230771","I.E.P.   - 70069","I.E.P. ","Educación Básica Regular      ","A1  - Pública - Sector Educación                                  ",8,"COATA","Rural"]
[755,"COATA","CAPAJSI","0230425","I.E.P.   - 70032","I.E.P. ","Educación Básica Regular      ","A1  - Pública - Sector Educación                                  ",121,"COATA","Rural"]
[756,"COATA","SUCASCO","0218438","I.E.P.   - 70609","I.E.P. ","Educación Básica Regular      ","A1  - Pública - Sector Educación                                  ",35,"COATA","Urbana"]
[757,"COATA","SAJANACACHI","0474445","I.E.P.   - 70704","I.E.P. ","Educación Básica Regular      ","A1  - Pública - Sector Educación                                  ",25,"COATA","Rural"]
[758,"PLATERIA","POTOJANI CHICO","0231027","I.E.P.   - 70095","I.E.P. ","Educación Básica Regular      ","A1  - Pública - Sector Educación                                  ",11,"PLATERIA","Rural"]
[761,"PLATERIA","TOTOJIRA","0231126","I.E.P.   - 70105","I.E.P. ","Educación Básica Regular      ","A1  - Pública - Sector Educación                                  ",3,"PLATERIA","Rural"]
[762,"PLATERIA","LACCONI","0230953","I.E.P.   - 70088","I.E.P. ","Educación Básica Regular      ","A1  - Pública - Sector Educación                                  ",14,"PLATERIA","Rural"]
[763,"PLATERIA","AÑO CALLEJON","0231159","I.E.P.   - 70108","I.E.P. ","Educación Básica Regular      ","A1  - Pública - Sector Educación                                  ",13,"PLATERIA","Rural"]
[764,"PLATERIA","CHILATA","0231662","I.E.P.   - 70159","I.E.P. ","Educación Básica Regular      ","A1  - Pública - Sector Educación                                  ",12,"PLATERIA","Rural"]
[765,"PLATERIA","PERCA","0231316","I.E.P.   - 70124","I.E.P. ","Educación Básica Regular      ","A1  - Pública - Sector Educación                                  ",55,"PLATERIA","Rural"]
[766,"PLATERIA","CAMACANI","0231167","I.E.P.   - 70109","I.E.P. ","Educación Básica Regular      ","A1  - Pública - Sector Educación                                  ",38,"PLATERIA","Urbana"]
[767,"PLATERIA","CCOTA","0231217","I.E.P.   - 70114","I.E.P. ","Educación Básica Regular      ","A1  - Pública - Sector Educación                                  ",53,"PLATERIA","Urbana"]
[768,"PLATERIA","PALLALLA","0231225","I.E.P.   - 70115 MARIA ASUNCION GALINDO","I.E.P. ","Educación Básica Regular      ","A1  - Pública - Sector Educación                                  ",45,"PLATERIA","Rural"]
[770,"PLATERIA","TITILACA","0230961","I.E.P.   - 70089","I.E.P. ","Educación Básica Regular      ","A1  - Pública - Sector Educación                                  ",28,"PLATERIA","Rural"]
[771,"PLATERIA","SIHUECANI","0231514","I.E.P.   - 70144","I.E.P. ","Educación Básica Regular      ","A1  - Pública - Sector Educación                                  ",20,"PLATERIA","Rural"]
[772,"PLATERIA","CAMATA","0231175","I.E.P.   - 70110","I.E.P. ","Educación Básica Regular      ","A1  - Pública - Sector Educación                                  ",26,"PLATERIA","Rural"]
[773,"PLATERIA","NAZAPARCO","0559476","I.E.P.   - 70684","I.E.P. ","Educación Básica Regular      ","A1  - Pública - Sector Educación                                  ",7,"PLATERIA","Rural"]
[774,"PLATERIA","TITILACA","0804419","I.E.P.   - 70757","I.E.P. ","Educación Básica Regular      ","A1  - Pública - Sector Educación                                  ",13,"PLATERIA","Rural"]
[775,"PLATERIA","RINCONADA","0804435","I.E.P.   - 70725","I.E.P. ","Educación Básica Regular      ","A1  - Pública - Sector Educación                                  ",15,"PLATERIA","Rural"]
[786,"HUATA","HUATTA","1753730","I.E.S.  - MIGUEL GRAU SEMINARIO","I.E.S.","Educación Básica Regular      ","A1  - Pública - Sector Educación                                  ",25,"HUATA","Urbana"]
[791,"ACORA","SOCCA","0706580","I.E.S.  - TUPAQ KATARI","I.E.S.","Educación Básica Regular      ","A1  - Pública - Sector Educación                                  ",77,"ACORA","Rural"]
[792,"ACORA","CULTA","0474494","I.E.S.  - TUPAC AMARU II","I.E.S.","Educación Básica Regular      ","A1  - Pública - Sector Educación                                  ",69,"ACORA","Rural"]
[793,"ACORA","JAYU JAYU","0579029","I.E.S.  - CARLOS DANTE NAVA","I.E.S.","Educación Básica Regular      ","A1  - Pública - Sector Educación                                  ",116,"ACORA","Urbana"]
[794,"ACORA","SANTA ROSA","0578971","I.E.S.  - ENRIQUE ENCINAS FRANCO","I.E.S.","Educación Básica Regular      ","A1  - Pública - Sector Educación                                  ",13,"ACORA","Rural"]
[797,"ACORA","JILATAMARCA","1260124","I.E.S.  - GILATAMARCA","I.E.S.","Educación Básica Regular      ","A1  - Pública - Sector Educación                                  ",21,"ACORA","Rural"]
[798,"ACORA","CARITAMAYA","1541887","I.E.S.  - FLORENTINO AMEGHINO","I.E.S.","Educación Básica Regular      ","A3  - Pública - Municipalidad                                     ",40,"ACORA","Urbana"]
[799,"ACORA","THUNUHUAYA","1025113","I.E.S.  - THUNUHUAYA","I.E.S.","Educación Básica Regular      ","A1  - Pública - Sector Educación                                  ",20,"ACORA","Rural"]
[800,"ACORA","THUNCO","0744441","I.E.S.  - THUNCO","I.E.S.","Educación Básica Regular      ","A1  - Pública - Sector Educación                                  ",48,"ACORA","Rural"]
[801,"ACORA","AYRUMAS CARUMAS","1029982","I.E.S.  - AYRUMAS CARUMAS","I.E.S.","Educación Básica Regular      ","A1  - Pública - Sector Educación                                  ",39,"ACORA","Rural"]
[803,"ACORA","CUCHO ESQUEÑA","1025196","I.E.S.  - SAN JUAN","I.E.S.","Educación Básica Regular      ","A1  - Pública - Sector Educación                                  ",35,"ACORA","Rural"]
[804,"ACORA","AGUAS CALIENTES","1572544","I.E.S.  - MANCO CAPAC","I.E.S.","Educación Básica Regular      ","A1  - Pública - Sector Educación                                  ",9,"ACORA","Rural"]
[805,"ACORA","ACORA","1418169","I.E.S.  - AYMARA","I.E.S.","Educación Básica Regular      ","A3  - Pública - Municipalidad                                     ",133,"ACORA","Urbana"]
[807,"ACORA","CCOPAYA","1385061","I.E.S.  - CCAPALLA","I.E.S.","Educación Básica Regular      ","A1  - Pública - Sector Educación                                  ",70,{"$f":"+B834","v":"ACORA"},"Urbana"]
[808,"AMANTANI","TAQUILE","1025394","I.E.S.  - TAQUILE","I.E.S.","Educación Básica Regular      ","A1  - Pública - Sector Educación                                  ",155,"AMANTANI","Rural"]
[809,"AMANTANI","AMANTANI","0631135","I.E.S.  - MIGUEL GRAU","I.E.S.","Educación Básica Regular      ","A1  - Pública - Sector Educación                                  ",176,"AMANTANI","Urbana"]
[810,"CHUCUITO","HUAIRAPATA","0521997","I.E.S.  - INCA GARCILAZO DE LA VEGA","I.E.S.","Educación Básica Regular      ","A1  - Pública - Sector Educación                                  ",51,"CHUCUITO","Rural"]
[812,"CHUCUITO","CARINA","1023522","I.E.S.  - LEONCIO PRADO","I.E.S.","Educación Básica Regular      ","A1  - Pública - Sector Educación                                  ",71,"CHUCUITO","Rural"]
[813,"CHUCUITO","POTOJANI GRANDE","1023605","I.E.S.  - POTOJANI GRANDE","I.E.S.","Educación Básica Regular      ","A1  - Pública - Sector Educación                                  ",40,"CHUCUITO","Rural"]
[815,"CHUCUITO","INCHYPALLA","1400738","I.E.S.  - INCHUPALLA","I.E.S.","Educación Básica Regular      ","A3  - Pública - Municipalidad                                     ",24,"CHUCUITO","Rural"]
[816,"CHUCUITO","TACASAYA","1023563","I.E.S.  - MARIANO MELGAR VALDIVIESO","I.E.S.","Educación Básica Regular      ","A1  - Pública - Sector Educación                                  ",42,"CHUCUITO","Rural"]
[817,"CHUCUITO","CHUCUITO","1669753","I.E.S.  - COAR PUNO","I.E.S.","Educación Básica Regular      ","A1  - Pública - Sector Educación                                  ",294,"CHUCUITO","Urbana"]
[818,"MAÑAZO","MAÑAZO","1746304","I.E.S.  - MAÑAZO","I.E.S.","Educación Básica Regular      ","A1  - Pública - Sector Educación                                  ",16,"MAÑAZO","Urbana"]
[822,"SAN ANTONIO","JUNCAL","1024124","I.E.S.  - LOS ANDES","I.E.S.","Educación Básica Regular      ","A1  - Pública - Sector Educación                                  ",50,"SAN ANTONIO","Urbana"]
[824,"PUNO","UROS CHULLUNI","1025774","I.E.S.  - UROS CHULLUNI","I.E.S.","Educación Básica Regular      ","A1  - Pública - Sector Educación                                  ",37,"PUNO","Rural"]
[825,"PUNO","SAN ANTONIO","1029974","I.E.S.  - SAN ANTONIO DE PADUA","I.E.S.","Educación Básica Regular      ","A1  - Pública - Sector Educación                                  ",108,"PUNO","Urbana"]
[826,"PUNO","CIUDAD UNIVERSITARIA","1024033","I.E.S.  - JOSE CARLOS MARIATEGUI APLICACION UNA","I.E.S.","Educación Básica Regular      ","A1  - Pública - Sector Educación                                  ",328,"PUNO","Urbana"]
[828,"PUNO","VILLA DEL LAGO","1029644","I.E.S.  - VILLA DEL LAGO","I.E.S.","Educación Básica Regular      ","A1  - Pública - Sector Educación                                  ",172,"PUNO","Urbana"]
[830,"PUNO","PUNO","0240267","I.E.S.  - MARIA AUXILIADORA","I.E.S.","Educación Básica Regular      ","A1  - Pública - Sector Educación                                  ",1066,"PUNO","Urbana"]
[832,"PUNO","HACIENDA COLLACACHI","0578815","I.E.S.  - COLLACACHI","I.E.S.","Educación Básica Regular      ","A1  - Pública - Sector Educación                                  ",13,"PUNO","Rural"]
[833,"PUNO","PUNO","0578799","I.E.S.  - JOSE ANTONIO ENCINAS","I.E.S.","Educación Básica Regular      ","A1  - Pública - Sector Educación                                  ",196,"PUNO","Urbana"]
[838,"PUNO","BELLAVISTA","0578773","I.E.S.  - INDEPENDENCIA NACIONAL","I.E.S.","Educación Básica Regular      ","A1  - Pública - Sector Educación                                  ",506,"PUNO","Urbana"]
[842,"PUNO","ALTO PUNO","1721471","I.E.S.  - SAN SALVADOR","I.E.S.","Educación Básica Regular      ","A1  - Pública - Sector Educación                                  ",27,"PUNO","Urbana"]
[843,"PUNO","CHANU CHANU ETAPA 1","1372879","I.E.S.  - INCA MANCO CAPAC","I.E.S.","Educación Básica Regular      ","A2  - Pública - Otro Sector Público                               ",179,"PUNO","Urbana"]
[844,"ATUNCOLLA","TICANI PAMPA","1376938","I.E.S.  - CRFA AMANECER QOLLA","I.E.S.","Educación Básica Regular      ","A4  - Pública - En convenio                                       ",67,"ATUNCOLLA","Rural"]
[845,"ATUNCOLLA","LLUNGO","1564608","I.E.S.  - SAN JOSE DE LLUNGO","I.E.S.","Educación Básica Regular      ","A1  - Pública - Sector Educación                                  ",96,"ATUNCOLLA","Rural"]
[851,"TIQUILLACA","TIQUILLACA","0536912","I.E.S.  - SAN FRANCISCO","I.E.S.","Educación Básica Regular      ","A1  - Pública - Sector Educación                                  ",116,"TIQUILLACA","Urbana"]
[852,"COATA","SAJANACACHI","1023647","I.E.S.  - SAJANACACHI","I.E.S.","Educación Básica Regular      ","A1  - Pública - Sector Educación                                  ",45,"COATA","Rural"]
[857,"PLATERIA","TITILACA","1024041","I.E.S.  - ANDRES AVELINO CACERES","I.E.S.","Educación Básica Regular      ","A1  - Pública - Sector Educación                                  ",60,"PLATERIA","Rural"]
[858,"PLATERIA","CCOTA","0474502","I.E.S.  - CCOTA","I.E.S.","Educación Básica Regular      ","A1  - Pública - Sector Educación                                  ",41,"PLATERIA","Urbana"]
[860,"PLATERIA","PALLALLA","0615203","I.E.S.  - JULIO GONZALES RUIZ","I.E.S.","Educación Básica Regular      ","A1  - Pública - Sector Educación                                  ",77,"PLATERIA","Rural"]
[861,"PLATERIA","PERCA","0521799","I.E.S.  - VICTOR RAUL HAYA DE LA TORRE","I.E.S.","Educación Básica Regular      ","A1  - Pública - Sector Educación                                  ",51,"PLATERIA","Rural"]
[null,null,null,"0240523","CEBA - 71013 GLORIOSO SAN CARLOS","Básica Alternativa - Inicial e Intermedio",null,null,21,"Puno","Urbana"]
[null,null,null,"1025741","CEBA - 70025 INDEPENDENCIA NACIONAL","Básica Alternativa - Inicial e Intermedio",null,null,5,"Puno","Urbana"]
[null,null,null,"0239632","CEBA - 71013 GLORIOSO SAN CARLOS","Básica Alternativa - Avanzado",null,null,197,"Puno","Urbana"]
[null,null,null,"1024314","CEBA - SANTA ROSA","Básica Alternativa - Avanzado",null,null,88,"Puno","Urbana"]
[null,null,null,"1024355","CEBA - 70025 INDEPENDENCIA NACIONAL","Básica Alternativa - Avanzado",null,null,54,"Puno","Urbana"]
[null,null,null,"1331883","CEBA - VILLA DEL LAGO","Básica Alternativa - Avanzado",null,null,130,"Puno","Urbana"]
[null,null,null,"1360122","CEBA - MAÑAZO","Básica Alternativa - Avanzado",null,null,50,"Mañazo","Urbana"]
[null,null,null,"1360130","CEBA - 45 EMILIO ROMERO PADILLA","Básica Alternativa - Avanzado",null,null,78,"Puno","Urbana"]
[null,null,null,"1360148","CEBA - JOSE ANTONIO ENCINAS","Básica Alternativa - Avanzado",null,null,156,"Puno","Urbana"]
[null,null,null,"1360155","CEBA - 32","Básica Alternativa - Avanzado",null,null,81,"Puno","Urbana"]
[null,null,null,"1564590","CEBA - APLICACION PEDAGOGICO PUNO","Básica Alternativa - Avanzado",null,null,85,"Puno","Urbana"]
[null,null,null,"1702331","CEBA - VIRGEN DE LA ASUNCION","Básica Alternativa - Avanzado",null,null,43,"Puno","Urbana"]
[null,null,null,"1724855","CEBA - GUE SAN CARLOS","Básica Alternativa - Avanzado",null,null,260,"Puno","Urbana"]