{"text_format":"1","workbook":"xlsx","n_sheets":7,"sheets":["CN 2019_BIENES","CN_2019_SERVICOS","CENTRO DE COSTOS","CATALOGO","CENTRO_COSTO","ACTIVIDAD POI 2019","INSTRUCTIVO"],"not_rendered":{"charts":0,"images":3,"macros":1,"external_links":1,"defined_names":25,"comments":0,"pivot_tables":0},"unopened":[],"bounds":{"document_bytes":16777216,"sheet_cells":100000,"rows_first":2000,"rows_last":500,"rows_between":2000,"halvings":0,"cell_chars":16384,"cell_head_chars":4096},"cells_cut":0,"cells_raw":0,"read":"whole","date_system":"1900"}

{"sheet":"CN 2019_BIENES","index":0,"n_rows":82,"n_cols":19,"rows_kept":82,"cut":false,"hidden":false,"merged":[[0,4,0,14],[0,15,0,16],[0,17,0,18],[1,4,1,14],[1,15,1,16],[1,17,1,18],[6,0,6,4],[6,16,6,17],[7,0,7,2],[7,4,7,5],[7,7,7,8],[7,10,7,15],[3,0,3,2],[3,7,3,8],[3,10,3,13],[3,14,3,15],[4,0,4,3],[5,0,5,2],[5,4,5,8],[5,10,5,13],[5,14,5,15],[9,1,9,2],[9,4,9,7],[9,10,9,11],[9,12,9,13],[9,14,9,15],[10,1,10,2],[10,4,10,7],[10,10,10,11],[10,12,10,13],[10,14,10,15],[11,1,11,2],[11,4,11,7],[11,10,11,11],[11,12,11,13],[11,14,11,15],[12,1,12,2],[12,4,12,7],[12,10,12,11],[12,12,12,13],[12,14,12,15],[13,1,13,2],[13,4,13,7],[13,10,13,11],[13,12,13,13],[13,14,13,15],[14,1,14,2],[14,4,14,7],[14,10,14,11],[14,12,14,13],[14,14,14,15],[15,1,15,2],[15,4,15,7],[15,10,15,11],[15,12,15,13],[15,14,15,15],[16,1,16,2],[16,4,16,7],[16,10,16,11],[16,12,16,13],[16,14,16,15],[17,1,17,2],[17,4,17,7],[17,10,17,11],[17,12,17,13],[17,14,17,15],[18,1,18,2],[18,4,18,7],[18,10,18,11],[18,12,18,13],[18,14,18,15],[19,1,19,2],[19,4,19,7],[19,10,19,11],[19,12,19,13],[19,14,19,15],[20,1,20,2],[20,4,20,7],[20,10,20,11],[20,12,20,13],[20,14,20,15],[21,1,21,2],[21,4,21,7],[21,10,21,11],[21,12,21,13],[21,14,21,15],[22,1,22,2],[22,4,22,7],[22,10,22,11],[22,12,22,13],[22,14,22,15],[23,1,23,2],[23,4,23,7],[23,10,23,11],[23,12,23,13],[23,14,23,15],[24,1,24,2],[24,4,24,7],[24,10,24,11],[24,12,24,13],[24,14,24,15],[25,1,25,2],[25,4,25,7],[25,10,25,11],[25,12,25,13],[25,14,25,15],[26,1,26,2],[26,4,26,7],[26,10,26,11],[26,12,26,13],[26,14,26,15],[27,1,27,2],[27,4,27,7],[27,10,27,11],[27,12,27,13],[27,14,27,15],[28,1,28,2],[28,4,28,7],[28,10,28,11],[28,12,28,13],[28,14,28,15],[29,1,29,2],[29,4,29,7],[29,10,29,11],[29,12,29,13],[29,14,29,15],[30,1,30,2],[30,4,30,7],[30,10,30,11],[30,12,30,13],[30,14,30,15],[31,1,31,2],[31,4,31,7],[31,10,31,11],[31,12,31,13],[31,14,31,15],[32,1,32,2],[32,4,32,7],[32,10,32,11],[32,12,32,13],[32,14,32,15],[33,1,33,2],[33,4,33,7],[33,10,33,11],[33,12,33,13],[33,14,33,15],[34,1,34,2],[34,4,34,7],[34,10,34,11],[34,12,34,13],[34,14,34,15],[35,1,35,2],[35,4,35,7],[35,10,35,11],[35,12,35,13],[35,14,35,15],[36,1,36,2],[36,4,36,7],[36,10,36,11],[36,12,36,13],[36,14,36,15],[37,1,37,2],[37,4,37,7],[37,10,37,11],[37,12,37,13],[37,14,37,15],[38,1,38,2],[38,4,38,7],[38,10,38,11],[38,12,38,13],[38,14,38,15],[39,1,39,2],[39,4,39,7],[39,10,39,11],[39,12,39,13],[39,14,39,15],[40,1,40,2],[40,4,40,7],[40,10,40,11],[40,12,40,13],[40,14,40,15],[41,1,41,2],[41,4,41,7],[41,10,41,11],[41,12,41,13],[41,14,41,15],[42,1,42,2],[42,4,42,7],[42,10,42,11],[42,12,42,13],[42,14,42,15],[43,1,43,2],[43,4,43,7],[43,10,43,11],[43,12,43,13],[43,14,43,15],[44,1,44,2],[44,4,44,7],[44,10,44,11],[44,12,44,13],[44,14,44,15],[45,1,45,2],[45,4,45,7],[45,10,45,11],[45,12,45,13],[45,14,45,15],[46,1,46,2],[46,4,46,7],[46,10,46,11],[46,12,46,13],[46,14,46,15],[47,1,47,2],[47,4,47,7],[47,10,47,11],[47,12,47,13],[47,14,47,15],[48,1,48,2],[48,4,48,7],[48,10,48,11],[48,12,48,13],[48,14,48,15],[49,1,49,2],[49,4,49,7],[49,10,49,11],[49,12,49,13],[49,14,49,15],[50,1,50,2],[50,4,50,7],[50,10,50,11],[50,12,50,13],[50,14,50,15],[51,1,51,2],[51,4,51,7],[51,10,51,11],[51,12,51,13],[51,14,51,15],[52,1,52,2],[52,4,52,7],[52,10,52,11],[52,12,52,13],[52,14,52,15],[53,1,53,2],[53,4,53,7],[53,10,53,11],[53,12,53,13],[53,14,53,15],[54,1,54,2],[54,4,54,7],[54,10,54,11],[54,12,54,13],[54,14,54,15],[55,1,55,2],[55,4,55,7],[55,10,55,11],[55,12,55,13],[55,14,55,15],[56,1,56,2],[56,4,56,7],[56,10,56,11],[56,12,56,13],[56,14,56,15],[57,1,57,2],[57,4,57,7],[57,10,57,11],[57,12,57,13],[57,14,57,15],[58,1,58,2],[58,4,58,7],[58,10,58,11],[58,12,58,13],[58,14,58,15],[59,1,59,2],[59,4,59,7],[59,10,59,11],[59,12,59,13],[59,14,59,15],[60,1,60,2],[60,4,60,7],[60,10,60,11],[60,12,60,13],[60,14,60,15],[61,1,61,2],[61,4,61,7],[61,10,61,11],[61,12,61,13],[61,14,61,15],[62,1,62,2],[62,4,62,7],[62,10,62,11],[62,12,62,13],[62,14,62,15],[63,1,63,2],[63,4,63,7],[63,10,63,11],[63,12,63,13],[63,14,63,15],[64,1,64,2],[64,4,64,7],[64,10,64,11],[64,12,64,13],[64,14,64,15],[65,1,65,2],[65,4,65,7],[65,10,65,11],[65,12,65,13],[65,14,65,15],[66,1,66,2],[66,4,66,7],[66,10,66,11],[66,12,66,13],[66,14,66,15],[67,1,67,2],[67,4,67,7],[67,10,67,11],[67,12,67,13],[67,14,67,15],[68,1,68,2],[68,4,68,7],[68,10,68,11],[68,12,68,13],[68,14,68,15],[69,1,69,2],[69,4,69,7],[69,10,69,11],[69,12,69,13],[69,14,69,15],[70,1,70,2],[70,4,70,7],[70,10,70,11],[70,12,70,13],[70,14,70,15],[71,1,71,2],[71,4,71,7],[71,10,71,11],[71,12,71,13],[71,14,71,15],[72,1,72,2],[72,4,72,7],[72,10,72,11],[72,12,72,13],[72,14,72,15],[73,1,73,2],[73,4,73,7],[73,10,73,11],[73,12,73,13],[73,14,73,15],[74,1,74,2],[74,4,74,7],[74,10,74,11],[74,12,74,13],[74,14,74,15],[75,1,75,2],[75,4,75,7],[75,10,75,11],[75,12,75,13],[75,14,75,15],[76,1,76,2],[76,4,76,7],[76,10,76,11],[76,12,76,13],[76,14,76,15],[77,1,77,2],[77,4,77,7],[77,10,77,11],[77,12,77,13],[77,14,77,15],[78,1,78,2],[78,4,78,7],[78,10,78,11],[78,12,78,13],[78,14,78,15],[79,1,79,2],[79,4,79,7],[79,10,79,11],[79,12,79,13],[79,14,79,15],[80,1,80,2],[80,4,80,7],[80,10,80,11],[80,12,80,13],[80,14,80,15]]}
[null,null,null,null,"UNIDAD DE GESTION EDUCATIVA LOCAL PUNO UE 311"]
[null,null,null,null,"CUADRO DE NECESIDADES 2019",null,null,null,null,null,null,null,null,null,null,null,null,"CARV($E$4;CENTRO_COSTO!$C$2:$K$888;10;FALSO)"]
[]
["Codigo Centro de Costo",null,null,null,"1434.04.04",null,"Numero de Celular","980890282",null,null,"Nº  Personas",null,null,null,1]
[]
["Centro de Costos",null,null,null,{"$f":"+VLOOKUP($E$4,CENTRO_COSTO!$C$2:$D$888,2,FALSE)","v":"OFICINA DE CONTABILIDAD"},null,null,null,null,null,"Actividad de POI",null,null,null,null,null,null,{"$f":"IF(E4=\"\",\"\",VLOOKUP(E4,PERSONAL,9,FALSE))","v":906.99599999999998}]
[]
["Nombres y Apellidos ",null,null,null,{"$f":"IF(E4=\"\",\"\",VLOOKUP(E4,PERSONAL,4,FALSE))","v":"APAZAROJASJAVIER"},null,"Correo Electronico","1234@hotmail.com",null,null,"GESTION ADMINISTRATIVA",null,null,null,null,null,null,{"$f":"SUM(R11:R81)","v":32}]
[]
["CODIGO INTERNO","Clasificador de Gasto",null,"CATALOGO SIGA","DESCRIPCIÓN",null,null,null,"Unidad\nde medida","Precio Estimado","I DOTACION\nENE - ABR",null,"II DOTACION\nJUN - AGOT",null,"III DOTACION\nSET - DIC",null,"CANTIDAD","TOTAL","OBSERVACIONES"]
[3,null,null,{"$f":"IF(A11=\"\",\"\",VLOOKUP(A11,CATALOGO,2,FALSE))","v":"133000140079"},{"$f":"IF(A11=\"\",\"\",VLOOKUP(A11,CATALOGO,3,FALSE))","v":"AMBIENTADOR EN SPRAY X 360 mL"},null,null,null,{"$f":"IF(A11=\"\",\"\",VLOOKUP(A11,CATALOGO,4,FALSE))","v":"UNIDAD"},{"$f":"IF(D11=\"\",\"\",VLOOKUP(D11,CATALOGO!$B$2:$E$333,4,FALSE))","v":7},1,null,1,null,null,null,{"$f":"IF(A11=\"\",\"\",(N11+O11+P11+K11+M11))","v":2},{"$f":"IF(J11=\"\",\"\",(J11*Q11))","v":14}]
[15,null,null,"716000010212",{"$f":"IF(A12=\"\",\"\",VLOOKUP(A12,CATALOGO,3,FALSE))","v":"BOLIGRAFO (LAPICERO) DE TINTA SECA PUNTA MEDIA COLOR  AZUL"},null,null,null,{"$f":"IF(A12=\"\",\"\",VLOOKUP(A12,CATALOGO,4,FALSE))","v":"UNIDAD"},{"$f":"IF(D12=\"\",\"\",VLOOKUP(D12,CATALOGO!$B$2:$E$333,4,FALSE))","v":0.4},10,null,10,null,10,null,{"$f":"IF(A12=\"\",\"\",(N12+O12+P12+K12+M12))","v":30},12]
[16,null,null,"716000010213",{"$f":"IF(A13=\"\",\"\",VLOOKUP(A13,CATALOGO,3,FALSE))","v":"BOLIGRAFO (LAPICERO) DE TINTA SECA PUNTA MEDIA COLOR  NEGRO"},null,null,null,"UNIDAD",{"$f":"IF(D13=\"\",\"\",VLOOKUP(D13,CATALOGO!$B$2:$E$333,4,FALSE))","v":0.4},5,null,5,null,5,null,15,6]
[null,null,null,"",{"$f":"IF(A14=\"\",\"\",VLOOKUP(A14,CATALOGO,3,FALSE))","v":""},null,null,null,"",{"$f":"IF(D14=\"\",\"\",VLOOKUP(D14,CATALOGO!$B$2:$E$333,4,FALSE))","v":""},null,null,null,null,null,null,{"$f":"IF(A14=\"\",\"\",(N14+O14+P14+K14+M14))","v":""},""]
[null,null,null,"","",null,null,null,"",{"$f":"IF(D15=\"\",\"\",VLOOKUP(D15,CATALOGO!$B$2:$E$333,4,FALSE))","v":""},null,null,null,null,null,null,"",""]
[null,null,null,"","",null,null,null,"",{"$f":"IF(D16=\"\",\"\",VLOOKUP(D16,CATALOGO!$B$2:$E$333,4,FALSE))","v":""},null,null,null,null,null,null,"",{"$f":"IF(J16=\"\",\"\",(J16*Q16))","v":""}]
[null,null,null,"","",null,null,null,"",{"$f":"IF(D17=\"\",\"\",VLOOKUP(D17,CATALOGO!$B$2:$E$333,4,FALSE))","v":""},null,null,null,null,null,null,"",""]
[null,null,null,"","",null,null,null,"",{"$f":"IF(D18=\"\",\"\",VLOOKUP(D18,CATALOGO!$B$2:$E$333,5,FALSE))","v":""},null,null,null,null,null,null,"",""]
[null,null,null,"",{"$f":"IF(A19=\"\",\"\",VLOOKUP(A19,CATALOGO,3,FALSE))","v":""},null,null,null,"",{"$f":"IF(D19=\"\",\"\",VLOOKUP(D19,CATALOGO!$B$2:$E$333,4,FALSE))","v":""},null,null,null,null,null,null,"",""]
[null,null,null,"","",null,null,null,"",{"$f":"IF(D20=\"\",\"\",VLOOKUP(D20,CATALOGO!$B$2:$E$333,4,FALSE))","v":""},null,null,null,null,null,null,"",""]
[null,null,null,"","",null,null,null,"",{"$f":"IF(D21=\"\",\"\",VLOOKUP(D21,CATALOGO!$B$2:$E$333,4,FALSE))","v":""},null,null,null,null,null,null,"",""]
[null,null,null,"","",null,null,null,"",{"$f":"IF(D22=\"\",\"\",VLOOKUP(D22,CATALOGO!$B$2:$E$333,4,FALSE))","v":""},null,null,null,null,null,null,"",""]
[null,null,null,"","",null,null,null,"",{"$f":"IF(D23=\"\",\"\",VLOOKUP(D23,CATALOGO!$B$2:$E$333,4,FALSE))","v":""},null,null,null,null,null,null,"",""]
[null,null,null,"","",null,null,null,"",{"$f":"IF(D24=\"\",\"\",VLOOKUP(D24,CATALOGO!$B$2:$E$333,4,FALSE))","v":""},null,null,null,null,null,null,"",""]
[null,null,null,"","",null,null,null,"",{"$f":"IF(D25=\"\",\"\",VLOOKUP(D25,CATALOGO!$B$2:$E$333,4,FALSE))","v":""},null,null,null,null,null,null,"",""]
[null,null,null,"","",null,null,null,"",{"$f":"IF(D26=\"\",\"\",VLOOKUP(D26,CATALOGO!$B$2:$E$333,4,FALSE))","v":""},null,null,null,null,null,null,"",""]
[null,null,null,"","",null,null,null,"",{"$f":"IF(D27=\"\",\"\",VLOOKUP(D27,CATALOGO!$B$2:$E$333,4,FALSE))","v":""},null,null,null,null,null,null,"",""]
[null,null,null,"","",null,null,null,"",{"$f":"IF(D28=\"\",\"\",VLOOKUP(D28,CATALOGO!$B$2:$E$333,4,FALSE))","v":""},null,null,null,null,null,null,"",""]
[null,null,null,"","",null,null,null,"",{"$f":"IF(D29=\"\",\"\",VLOOKUP(D29,CATALOGO!$B$2:$E$333,4,FALSE))","v":""},null,null,null,null,null,null,"",""]
[null,null,null,"","",null,null,null,"",{"$f":"IF(D30=\"\",\"\",VLOOKUP(D30,CATALOGO!$B$2:$E$333,4,FALSE))","v":""},null,null,null,null,null,null,"",""]
[null,null,null,"","",null,null,null,"",{"$f":"IF(D31=\"\",\"\",VLOOKUP(D31,CATALOGO!$B$2:$E$333,4,FALSE))","v":""},null,null,null,null,null,null,"",""]
[null,null,null,"","",null,null,null,"",{"$f":"IF(D32=\"\",\"\",VLOOKUP(D32,CATALOGO!$B$2:$E$333,4,FALSE))","v":""},null,null,null,null,null,null,"",""]
[null,null,null,"","",null,null,null,"",{"$f":"IF(D33=\"\",\"\",VLOOKUP(D33,CATALOGO!$B$2:$E$333,4,FALSE))","v":""},null,null,null,null,null,null,"",""]
[null,null,null,"","",null,null,null,"",{"$f":"IF(D34=\"\",\"\",VLOOKUP(D34,CATALOGO!$B$2:$E$333,4,FALSE))","v":""},null,null,null,null,null,null,"",""]
[null,null,null,"","",null,null,null,"",{"$f":"IF(D35=\"\",\"\",VLOOKUP(D35,CATALOGO!$B$2:$E$333,4,FALSE))","v":""},null,null,null,null,null,null,"",""]
[null,null,null,"","",null,null,null,"",{"$f":"IF(D36=\"\",\"\",VLOOKUP(D36,CATALOGO!$B$2:$E$333,4,FALSE))","v":""},null,null,null,null,null,null,"",""]
[null,null,null,"","",null,null,null,"",{"$f":"IF(D37=\"\",\"\",VLOOKUP(D37,CATALOGO!$B$2:$E$333,4,FALSE))","v":""},null,null,null,null,null,null,"",""]
[null,null,null,"","",null,null,null,"",{"$f":"IF(D38=\"\",\"\",VLOOKUP(D38,CATALOGO!$B$2:$E$333,4,FALSE))","v":""},null,null,null,null,null,null,"",""]
[null,null,null,"","",null,null,null,"",{"$f":"IF(D39=\"\",\"\",VLOOKUP(D39,CATALOGO!$B$2:$E$333,4,FALSE))","v":""},null,null,null,null,null,null,"",""]
[null,null,null,"","",null,null,null,"",{"$f":"IF(D40=\"\",\"\",VLOOKUP(D40,CATALOGO!$B$2:$E$333,4,FALSE))","v":""},null,null,null,null,null,null,"",""]
[null,null,null,"","",null,null,null,"",{"$f":"IF(D41=\"\",\"\",VLOOKUP(D41,CATALOGO!$B$2:$E$333,4,FALSE))","v":""},null,null,null,null,null,null,"",""]
[null,null,null,"","",null,null,null,"",{"$f":"IF(D42=\"\",\"\",VLOOKUP(D42,CATALOGO!$B$2:$E$333,4,FALSE))","v":""},null,null,null,null,null,null,"",""]
[null,null,null,"","",null,null,null,"",{"$f":"IF(D43=\"\",\"\",VLOOKUP(D43,CATALOGO!$B$2:$E$333,4,FALSE))","v":""},null,null,null,null,null,null,"",""]
[null,null,null,"","",null,null,null,"",{"$f":"IF(D44=\"\",\"\",VLOOKUP(D44,CATALOGO!$B$2:$E$333,4,FALSE))","v":""},null,null,null,null,null,null,"",""]
[null,null,null,"","",null,null,null,"",{"$f":"IF(D45=\"\",\"\",VLOOKUP(D45,CATALOGO!$B$2:$E$333,4,FALSE))","v":""},null,null,null,null,null,null,"",""]
[null,null,null,"","",null,null,null,"",{"$f":"IF(D46=\"\",\"\",VLOOKUP(D46,CATALOGO!$B$2:$E$333,4,FALSE))","v":""},null,null,null,null,null,null,"",""]
[null,null,null,"","",null,null,null,"",{"$f":"IF(D47=\"\",\"\",VLOOKUP(D47,CATALOGO!$B$2:$E$333,4,FALSE))","v":""},null,null,null,null,null,null,"",""]
[null,null,null,"","",null,null,null,"",{"$f":"IF(D48=\"\",\"\",VLOOKUP(D48,CATALOGO!$B$2:$E$333,4,FALSE))","v":""},null,null,null,null,null,null,"",""]
[null,null,null,"","",null,null,null,"",{"$f":"IF(D49=\"\",\"\",VLOOKUP(D49,CATALOGO!$B$2:$E$333,4,FALSE))","v":""},null,null,null,null,null,null,"",""]
[null,null,null,"","",null,null,null,"",{"$f":"IF(D50=\"\",\"\",VLOOKUP(D50,CATALOGO!$B$2:$E$333,4,FALSE))","v":""},null,null,null,null,null,null,"",""]
[null,null,null,"","",null,null,null,"",{"$f":"IF(D51=\"\",\"\",VLOOKUP(D51,CATALOGO!$B$2:$E$333,4,FALSE))","v":""},null,null,null,null,null,null,"",""]
[null,null,null,"","",null,null,null,"",{"$f":"IF(D52=\"\",\"\",VLOOKUP(D52,CATALOGO!$B$2:$E$333,4,FALSE))","v":""},null,null,null,null,null,null,"",""]
[null,null,null,"","",null,null,null,"",{"$f":"IF(D53=\"\",\"\",VLOOKUP(D53,CATALOGO!$B$2:$E$333,4,FALSE))","v":""},null,null,null,null,null,null,"",""]
[null,null,null,"","",null,null,null,"",{"$f":"IF(D54=\"\",\"\",VLOOKUP(D54,CATALOGO!$B$2:$E$333,4,FALSE))","v":""},null,null,null,null,null,null,"",""]
[null,null,null,"","",null,null,null,"",{"$f":"IF(D55=\"\",\"\",VLOOKUP(D55,CATALOGO!$B$2:$E$333,4,FALSE))","v":""},null,null,null,null,null,null,"",""]
[null,null,null,"","",null,null,null,"",{"$f":"IF(D56=\"\",\"\",VLOOKUP(D56,CATALOGO!$B$2:$E$333,4,FALSE))","v":""},null,null,null,null,null,null,"",""]
[null,null,null,"","",null,null,null,"",{"$f":"IF(D57=\"\",\"\",VLOOKUP(D57,CATALOGO!$B$2:$E$333,4,FALSE))","v":""},null,null,null,null,null,null,"",""]
[null,null,null,"","",null,null,null,"",{"$f":"IF(D58=\"\",\"\",VLOOKUP(D58,CATALOGO!$B$2:$E$333,4,FALSE))","v":""},null,null,null,null,null,null,"",""]
[null,null,null,"","",null,null,null,"",{"$f":"IF(D59=\"\",\"\",VLOOKUP(D59,CATALOGO!$B$2:$E$333,4,FALSE))","v":""},null,null,null,null,null,null,"",""]
[null,null,null,"","",null,null,null,"",{"$f":"IF(D60=\"\",\"\",VLOOKUP(D60,CATALOGO!$B$2:$E$333,4,FALSE))","v":""},null,null,null,null,null,null,"",""]
[null,null,null,"","",null,null,null,"",{"$f":"IF(D61=\"\",\"\",VLOOKUP(D61,CATALOGO!$B$2:$E$333,4,FALSE))","v":""},null,null,null,null,null,null,"",""]
[null,null,null,"","",null,null,null,"",{"$f":"IF(D62=\"\",\"\",VLOOKUP(D62,CATALOGO!$B$2:$E$333,4,FALSE))","v":""},null,null,null,null,null,null,"",""]
[null,null,null,"","",null,null,null,"",{"$f":"IF(D63=\"\",\"\",VLOOKUP(D63,CATALOGO!$B$2:$E$333,4,FALSE))","v":""},null,null,null,null,null,null,"",""]
[null,null,null,"","",null,null,null,"",{"$f":"IF(D64=\"\",\"\",VLOOKUP(D64,CATALOGO!$B$2:$E$333,4,FALSE))","v":""},null,null,null,null,null,null,"",""]
[null,null,null,"","",null,null,null,"",{"$f":"IF(D65=\"\",\"\",VLOOKUP(D65,CATALOGO!$B$2:$E$333,4,FALSE))","v":""},null,null,null,null,null,null,"",""]
[null,null,null,"","",null,null,null,"",{"$f":"IF(D66=\"\",\"\",VLOOKUP(D66,CATALOGO!$B$2:$E$333,4,FALSE))","v":""},null,null,null,null,null,null,"",""]
[null,null,null,"","",null,null,null,"",{"$f":"IF(D67=\"\",\"\",VLOOKUP(D67,CATALOGO!$B$2:$E$333,4,FALSE))","v":""},null,null,null,null,null,null,"",""]
[null,null,null,"","",null,null,null,"",{"$f":"IF(D68=\"\",\"\",VLOOKUP(D68,CATALOGO!$B$2:$E$333,4,FALSE))","v":""},null,null,null,null,null,null,"",""]
[null,null,null,"","",null,null,null,"",{"$f":"IF(D69=\"\",\"\",VLOOKUP(D69,CATALOGO!$B$2:$E$333,4,FALSE))","v":""},null,null,null,null,null,null,"",""]
[null,null,null,"","",null,null,null,"",{"$f":"IF(D70=\"\",\"\",VLOOKUP(D70,CATALOGO!$B$2:$E$333,4,FALSE))","v":""},null,null,null,null,null,null,"",""]
[null,null,null,"","",null,null,null,"",{"$f":"IF(D71=\"\",\"\",VLOOKUP(D71,CATALOGO!$B$2:$E$333,4,FALSE))","v":""},null,null,null,null,null,null,"",""]
[null,null,null,"","",null,null,null,"",{"$f":"IF(D72=\"\",\"\",VLOOKUP(D72,CATALOGO!$B$2:$E$333,4,FALSE))","v":""},null,null,null,null,null,null,"",""]
[null,null,null,"","",null,null,null,"",{"$f":"IF(D73=\"\",\"\",VLOOKUP(D73,CATALOGO!$B$2:$E$333,4,FALSE))","v":""},null,null,null,null,null,null,"",""]
[null,null,null,"","",null,null,null,"",{"$f":"IF(D74=\"\",\"\",VLOOKUP(D74,CATALOGO!$B$2:$E$333,4,FALSE))","v":""},null,null,null,null,null,null,"",""]
[null,null,null,{"$f":"IF(A75=\"\",\"\",VLOOKUP(A75,CATALOGO,2,FALSE))","v":""},"",null,null,null,{"$f":"IF(A75=\"\",\"\",VLOOKUP(A75,CATALOGO,4,FALSE))","v":""},{"$f":"IF(D75=\"\",\"\",VLOOKUP(D75,CATALOGO!$B$2:$E$333,4,FALSE))","v":""},null,null,null,null,null,null,"",{"$f":"IF(J75=\"\",\"\",(J75*Q75))","v":""}]
[null,null,null,"",{"$f":"IF(A76=\"\",\"\",VLOOKUP(A76,CATALOGO,3,FALSE))","v":""},null,null,null,"",{"$f":"IF(D76=\"\",\"\",VLOOKUP(D76,CATALOGO!$B$2:$E$333,4,FALSE))","v":""},null,null,null,null,null,null,{"$f":"IF(A76=\"\",\"\",(N76+O76+P76+K76+M76))","v":""},""]
[null,null,null,"","",null,null,null,"",{"$f":"IF(D77=\"\",\"\",VLOOKUP(D77,CATALOGO!$B$2:$E$333,4,FALSE))","v":""},null,null,null,null,null,null,"",""]
[null,null,null,"","",null,null,null,"",{"$f":"IF(D78=\"\",\"\",VLOOKUP(D78,CATALOGO!$B$2:$E$333,4,FALSE))","v":""},null,null,null,null,null,null,"",""]
[null,null,null,"","",null,null,null,"",{"$f":"IF(D79=\"\",\"\",VLOOKUP(D79,CATALOGO!$B$2:$E$333,4,FALSE))","v":""},null,null,null,null,null,null,"",""]
[null,null,null,"","",null,null,null,"",{"$f":"IF(D80=\"\",\"\",VLOOKUP(D80,CATALOGO!$B$2:$E$333,4,FALSE))","v":""},null,null,null,null,null,null,"",""]
[null,null,null,"","",null,null,null,"",{"$f":"IF(D81=\"\",\"\",VLOOKUP(D81,CATALOGO!$B$2:$E$333,4,FALSE))","v":""},null,null,null,null,null,null,"",""]
[null,null,null,null,null,null,null,null,null,null,null,null,null,null,null,null,null,{"$f":"SUM(R11:R81)","v":32}]

{"sheet":"CN_2019_SERVICOS","index":1,"n_rows":82,"n_cols":23,"rows_kept":82,"cut":false,"hidden":true,"merged":[[77,1,77,2],[78,1,78,2],[79,1,79,2],[80,1,80,2],[73,1,73,2],[74,1,74,2],[75,1,75,2],[76,1,76,2],[64,1,64,2],[65,1,65,2],[66,1,66,2],[67,1,67,2],[68,1,68,2],[69,1,69,2],[70,1,70,2],[71,1,71,2],[72,1,72,2],[55,1,55,2],[56,1,56,2],[57,1,57,2],[58,1,58,2],[59,1,59,2],[60,1,60,2],[61,1,61,2],[62,1,62,2],[63,1,63,2],[46,1,46,2],[47,1,47,2],[48,1,48,2],[49,1,49,2],[50,1,50,2],[51,1,51,2],[52,1,52,2],[53,1,53,2],[54,1,54,2],[37,1,37,2],[38,1,38,2],[39,1,39,2],[40,1,40,2],[41,1,41,2],[42,1,42,2],[43,1,43,2],[44,1,44,2],[45,1,45,2],[29,1,29,2],[30,1,30,2],[31,1,31,2],[32,1,32,2],[33,1,33,2],[34,1,34,2],[35,1,35,2],[36,1,36,2],[22,1,22,2],[23,1,23,2],[24,1,24,2],[25,1,25,2],[26,1,26,2],[27,1,27,2],[28,1,28,2],[15,1,15,2],[16,1,16,2],[17,1,17,2],[18,1,18,2],[19,1,19,2],[20,1,20,2],[21,1,21,2],[5,0,5,2],[7,0,7,2],[9,1,9,2],[10,1,10,2],[11,1,11,2],[12,1,12,2],[13,1,13,2],[14,1,14,2],[79,4,79,7],[80,4,80,7],[77,4,77,7],[76,4,76,7],[14,4,14,7],[15,4,15,7],[16,4,16,7],[22,4,22,7],[18,4,18,7],[19,4,19,7],[20,4,20,7],[21,4,21,7],[17,4,17,7],[29,4,29,7],[30,4,30,7],[31,4,31,7],[23,4,23,7],[24,4,24,7],[25,4,25,7],[26,4,26,7],[27,4,27,7],[28,4,28,7],[36,4,36,7],[37,4,37,7],[7,7,7,8],[3,0,3,2],[1,21,1,22],[7,4,7,5],[6,0,6,4],[0,4,0,20],[1,4,1,20],[0,21,0,22],[3,10,3,13],[5,10,5,13],[4,0,4,3],[5,4,5,8],[3,7,3,8],[7,10,7,20],[9,4,9,7],[10,4,10,7],[11,4,11,7],[12,4,12,7],[13,4,13,7],[32,4,32,7],[33,4,33,7],[34,4,34,7],[35,4,35,7],[38,4,38,7],[39,4,39,7],[40,4,40,7],[57,4,57,7],[58,4,58,7],[41,4,41,7],[42,4,42,7],[43,4,43,7],[44,4,44,7],[45,4,45,7],[46,4,46,7],[47,4,47,7],[48,4,48,7],[49,4,49,7],[50,4,50,7],[51,4,51,7],[52,4,52,7],[53,4,53,7],[54,4,54,7],[55,4,55,7],[56,4,56,7],[59,4,59,7],[60,4,60,7],[61,4,61,7],[78,4,78,7],[67,4,67,7],[69,4,69,7],[70,4,70,7],[62,4,62,7],[63,4,63,7],[64,4,64,7],[65,4,65,7],[66,4,66,7],[68,4,68,7],[71,4,71,7],[72,4,72,7],[73,4,73,7],[74,4,74,7],[75,4,75,7]]}
[null,null,null,null,"UNIDAD DE GESTION EDUCATIVA LOCAL PUNO UE 311"]
[null,null,null,null,"CUADRO DE NECESIDADES 2019",null,null,null,null,null,null,null,null,null,null,null,null,null,null,null,null,"CARV($E$4;CENTRO_COSTO!$C$2:$K$888;10;FALSO)"]
[]
["Codigo Centro de Costo",null,null,null,"1434.04.10",null,"Numero de Celular","980890282",null,null,"Nº  Personas",null,null,null,1]
[]
["Centro de Costos",null,null,null,{"$f":"+VLOOKUP($E$4,CENTRO_COSTO!$C$2:$D$888,2,FALSE)","v":"ALMACEN"},null,null,null,null,null,"Actividad de POI",null,null,null,null,null,null,null,null,null,null,{"$f":"IF(E4=\"\",\"\",VLOOKUP(E4,PERSONAL,5,FALSE))","v":14675}]
[]
["Nombres y Apellidos ",null,null,null,{"$f":"IF(E4=\"\",\"\",VLOOKUP(E4,PERSONAL,4,FALSE))","v":"MAMANILUQUEMARWIN"},null,"Correo Electronico","ro2g2@hotmail.com",null,null,"Actividad Administrativa",null,null,null,null,null,null,null,null,null,null,{"$f":"SUM(V11:V81)","v":500}]
[]
["CODIGO INTERNO","Clasificador de Gasto",null,"CATALOGO SIGA","DESCRIPCIÓN",null,null,null,"Unidad\nde medida","01","02","03","04","05","06","07","08","09","10","11","12","TOTAL","OBSERVACIONES"]
[415,null,null,{"$f":"IF(A11=\"\",\"\",VLOOKUP(A11,CATALOGO,2,FALSE))","v":"767400060481"},{"$f":"IF(A11=\"\",\"\",VLOOKUP(A11,CATALOGO,3,FALSE))","v":"TÓNER DE IMPRESIÓN PARA HP COD. REF. 15A C7115A NEGRO"},null,null,null,{"$f":"IF(A11=\"\",\"\",VLOOKUP(A11,CATALOGO,4,FALSE))","v":"UNIDAD"},100,200,null,null,null,null,null,null,null,null,null,null,{"$f":"SUM(J11+K11+L11+N11+O11+P11+Q11+R11+S11+T11+U11)","v":300}]
[425,null,null,"767400061508",{"$f":"IF(A12=\"\",\"\",VLOOKUP(A12,CATALOGO,3,FALSE))","v":"TÓNER DE IMPRESIÓN PARA KYOCERA COD. REF. TK 1147 NEGRO"},null,null,null,{"$f":"IF(A12=\"\",\"\",VLOOKUP(A12,CATALOGO,4,FALSE))","v":"UNIDAD"},null,null,null,null,null,null,null,null,null,null,null,null,{"$f":"SUM(J12+K12+L12+N12+O12+P12+Q12+R12+S12+T12+U12)","v":0}]
[445,null,null,"135000180041","TRAPEADOR MOPA DE PABILO DE 30 cm",null,null,null,"UNIDAD",null,null,null,200,null,null,null,null,null,200,null,null,200]
[null,null,null,"","",null,null,null,"",null,null,null,null,null,null,null,null,null,null,null,null,0]
[null,null,null,"","",null,null,null,"",null,null,null,null,null,null,null,null,null,null,null,null,0]
[null,null,null,"","",null,null,null,"",null,null,null,null,null,null,null,null,null,null,null,null,0]
[null,null,null,"","",null,null,null,"",null,null,null,null,null,null,null,null,null,null,null,null,{"$f":"IF(J17=\"\",\"\",(J17*K17+L17+M17+N17+O17+P17+Q17+R17+S17+T17+U17+#REF!))","v":""}]
[null,null,null,"","",null,null,null,"",null,null,null,null,null,null,null,null,null,null,null,null,{"$f":"IF(J18=\"\",\"\",(J18*K18+L18+M18+N18+O18+P18+Q18+R18+S18+T18+U18+#REF!))","v":""}]
[null,null,null,"","",null,null,null,"",null,null,null,null,null,null,null,null,null,null,null,null,{"$f":"IF(J19=\"\",\"\",(J19*K19+L19+M19+N19+O19+P19+Q19+R19+S19+T19+U19+#REF!))","v":""}]
[null,null,null,"","",null,null,null,"",null,null,null,null,null,null,null,null,null,null,null,null,{"$f":"IF(J20=\"\",\"\",(J20*K20+L20+M20+N20+O20+P20+Q20+R20+S20+T20+U20+#REF!))","v":""}]
[null,null,null,"","",null,null,null,"",null,null,null,null,null,null,null,null,null,null,null,null,{"$f":"IF(J21=\"\",\"\",(J21*K21+L21+M21+N21+O21+P21+Q21+R21+S21+T21+U21+#REF!))","v":""}]
[null,null,null,"","",null,null,null,"",null,null,null,null,null,null,null,null,null,null,null,null,{"$f":"IF(J22=\"\",\"\",(J22*K22+L22+M22+N22+O22+P22+Q22+R22+S22+T22+U22+#REF!))","v":""}]
[null,null,null,"","",null,null,null,"",null,null,null,null,null,null,null,null,null,null,null,null,{"$f":"IF(J23=\"\",\"\",(J23*K23+L23+M23+N23+O23+P23+Q23+R23+S23+T23+U23+#REF!))","v":""}]
[null,null,null,"","",null,null,null,"",null,null,null,null,null,null,null,null,null,null,null,null,{"$f":"IF(J24=\"\",\"\",(J24*K24+L24+M24+N24+O24+P24+Q24+R24+S24+T24+U24+#REF!))","v":""}]
[null,null,null,"","",null,null,null,"",null,null,null,null,null,null,null,null,null,null,null,null,{"$f":"IF(J25=\"\",\"\",(J25*K25+L25+M25+N25+O25+P25+Q25+R25+S25+T25+U25+#REF!))","v":""}]
[null,null,null,"","",null,null,null,"",null,null,null,null,null,null,null,null,null,null,null,null,{"$f":"IF(J26=\"\",\"\",(J26*K26+L26+M26+N26+O26+P26+Q26+R26+S26+T26+U26+#REF!))","v":""}]
[null,null,null,"","",null,null,null,"",null,null,null,null,null,null,null,null,null,null,null,null,{"$f":"IF(J27=\"\",\"\",(J27*K27+L27+M27+N27+O27+P27+Q27+R27+S27+T27+U27+#REF!))","v":""}]
[null,null,null,"","",null,null,null,"",null,null,null,null,null,null,null,null,null,null,null,null,{"$f":"IF(J28=\"\",\"\",(J28*K28+L28+M28+N28+O28+P28+Q28+R28+S28+T28+U28+#REF!))","v":""}]
[null,null,null,"","",null,null,null,"",null,null,null,null,null,null,null,null,null,null,null,null,{"$f":"IF(J29=\"\",\"\",(J29*K29+L29+M29+N29+O29+P29+Q29+R29+S29+T29+U29+#REF!))","v":""}]
[null,null,null,"","",null,null,null,"",null,null,null,null,null,null,null,null,null,null,null,null,{"$f":"IF(J30=\"\",\"\",(J30*K30+L30+M30+N30+O30+P30+Q30+R30+S30+T30+U30+#REF!))","v":""}]
[null,null,null,"","",null,null,null,"",null,null,null,null,null,null,null,null,null,null,null,null,{"$f":"IF(J31=\"\",\"\",(J31*K31+L31+M31+N31+O31+P31+Q31+R31+S31+T31+U31+#REF!))","v":""}]
[null,null,null,"","",null,null,null,"",null,null,null,null,null,null,null,null,null,null,null,null,{"$f":"IF(J32=\"\",\"\",(J32*K32+L32+M32+N32+O32+P32+Q32+R32+S32+T32+U32+#REF!))","v":""}]
[null,null,null,"","",null,null,null,"",null,null,null,null,null,null,null,null,null,null,null,null,{"$f":"IF(J33=\"\",\"\",(J33*K33+L33+M33+N33+O33+P33+Q33+R33+S33+T33+U33+#REF!))","v":""}]
[null,null,null,"","",null,null,null,"",null,null,null,null,null,null,null,null,null,null,null,null,{"$f":"IF(J34=\"\",\"\",(J34*K34+L34+M34+N34+O34+P34+Q34+R34+S34+T34+U34+#REF!))","v":""}]
[null,null,null,"","",null,null,null,"",null,null,null,null,null,null,null,null,null,null,null,null,{"$f":"IF(J35=\"\",\"\",(J35*K35+L35+M35+N35+O35+P35+Q35+R35+S35+T35+U35+#REF!))","v":""}]
[null,null,null,"","",null,null,null,"",null,null,null,null,null,null,null,null,null,null,null,null,{"$f":"IF(J36=\"\",\"\",(J36*K36+L36+M36+N36+O36+P36+Q36+R36+S36+T36+U36+#REF!))","v":""}]
[null,null,null,"","",null,null,null,"",null,null,null,null,null,null,null,null,null,null,null,null,{"$f":"IF(J37=\"\",\"\",(J37*K37+L37+M37+N37+O37+P37+Q37+R37+S37+T37+U37+#REF!))","v":""}]
[null,null,null,"","",null,null,null,"",null,null,null,null,null,null,null,null,null,null,null,null,{"$f":"IF(J38=\"\",\"\",(J38*K38+L38+M38+N38+O38+P38+Q38+R38+S38+T38+U38+#REF!))","v":""}]
[null,null,null,"","",null,null,null,"",null,null,null,null,null,null,null,null,null,null,null,null,{"$f":"IF(J39=\"\",\"\",(J39*K39+L39+M39+N39+O39+P39+Q39+R39+S39+T39+U39+#REF!))","v":""}]
[null,null,null,"","",null,null,null,"",null,null,null,null,null,null,null,null,null,null,null,null,{"$f":"IF(J40=\"\",\"\",(J40*K40+L40+M40+N40+O40+P40+Q40+R40+S40+T40+U40+#REF!))","v":""}]
[null,null,null,"","",null,null,null,"",null,null,null,null,null,null,null,null,null,null,null,null,{"$f":"IF(J41=\"\",\"\",(J41*K41+L41+M41+N41+O41+P41+Q41+R41+S41+T41+U41+#REF!))","v":""}]
[null,null,null,"","",null,null,null,"",null,null,null,null,null,null,null,null,null,null,null,null,{"$f":"IF(J42=\"\",\"\",(J42*K42+L42+M42+N42+O42+P42+Q42+R42+S42+T42+U42+#REF!))","v":""}]
[null,null,null,{"$f":"IF(A43=\"\",\"\",VLOOKUP(A43,CATALOGO,2,FALSE))","v":""},{"$f":"IF(A43=\"\",\"\",VLOOKUP(A43,CATALOGO,3,FALSE))","v":""},null,null,null,{"$f":"IF(A43=\"\",\"\",VLOOKUP(A43,CATALOGO,4,FALSE))","v":""},null,null,null,null,null,null,null,null,null,null,null,null,{"$f":"IF(J43=\"\",\"\",(J43*K43+L43+M43+N43+O43+P43+Q43+R43+S43+T43+U43+#REF!))","v":""}]
[null,null,null,"","",null,null,null,"",null,null,null,null,null,null,null,null,null,null,null,null,{"$f":"IF(J44=\"\",\"\",(J44*K44+L44+M44+N44+O44+P44+Q44+R44+S44+T44+U44+#REF!))","v":""}]
[null,null,null,"","",null,null,null,"",null,null,null,null,null,null,null,null,null,null,null,null,{"$f":"IF(J45=\"\",\"\",(J45*K45+L45+M45+N45+O45+P45+Q45+R45+S45+T45+U45+#REF!))","v":""}]
[null,null,null,"","",null,null,null,"",null,null,null,null,null,null,null,null,null,null,null,null,{"$f":"IF(J46=\"\",\"\",(J46*K46+L46+M46+N46+O46+P46+Q46+R46+S46+T46+U46+#REF!))","v":""}]
[null,null,null,"","",null,null,null,"",null,null,null,null,null,null,null,null,null,null,null,null,{"$f":"IF(J47=\"\",\"\",(J47*K47+L47+M47+N47+O47+P47+Q47+R47+S47+T47+U47+#REF!))","v":""}]
[null,null,null,"","",null,null,null,"",null,null,null,null,null,null,null,null,null,null,null,null,{"$f":"IF(J48=\"\",\"\",(J48*K48+L48+M48+N48+O48+P48+Q48+R48+S48+T48+U48+#REF!))","v":""}]
[null,null,null,"","",null,null,null,"",null,null,null,null,null,null,null,null,null,null,null,null,{"$f":"IF(J49=\"\",\"\",(J49*K49+L49+M49+N49+O49+P49+Q49+R49+S49+T49+U49+#REF!))","v":""}]
[null,null,null,"","",null,null,null,"",null,null,null,null,null,null,null,null,null,null,null,null,{"$f":"IF(J50=\"\",\"\",(J50*K50+L50+M50+N50+O50+P50+Q50+R50+S50+T50+U50+#REF!))","v":""}]
[null,null,null,"","",null,null,null,"",null,null,null,null,null,null,null,null,null,null,null,null,{"$f":"IF(J51=\"\",\"\",(J51*K51+L51+M51+N51+O51+P51+Q51+R51+S51+T51+U51+#REF!))","v":""}]
[null,null,null,"","",null,null,null,"",null,null,null,null,null,null,null,null,null,null,null,null,{"$f":"IF(J52=\"\",\"\",(J52*K52+L52+M52+N52+O52+P52+Q52+R52+S52+T52+U52+#REF!))","v":""}]
[null,null,null,"","",null,null,null,"",null,null,null,null,null,null,null,null,null,null,null,null,{"$f":"IF(J53=\"\",\"\",(J53*K53+L53+M53+N53+O53+P53+Q53+R53+S53+T53+U53+#REF!))","v":""}]
[null,null,null,"","",null,null,null,"",null,null,null,null,null,null,null,null,null,null,null,null,{"$f":"IF(J54=\"\",\"\",(J54*K54+L54+M54+N54+O54+P54+Q54+R54+S54+T54+U54+#REF!))","v":""}]
[null,null,null,"","",null,null,null,"",null,null,null,null,null,null,null,null,null,null,null,null,{"$f":"IF(J55=\"\",\"\",(J55*K55+L55+M55+N55+O55+P55+Q55+R55+S55+T55+U55+#REF!))","v":""}]
[null,null,null,"","",null,null,null,"",null,null,null,null,null,null,null,null,null,null,null,null,{"$f":"IF(J56=\"\",\"\",(J56*K56+L56+M56+N56+O56+P56+Q56+R56+S56+T56+U56+#REF!))","v":""}]
[null,null,null,"","",null,null,null,"",null,null,null,null,null,null,null,null,null,null,null,null,{"$f":"IF(J57=\"\",\"\",(J57*K57+L57+M57+N57+O57+P57+Q57+R57+S57+T57+U57+#REF!))","v":""}]
[null,null,null,"","",null,null,null,"",null,null,null,null,null,null,null,null,null,null,null,null,{"$f":"IF(J58=\"\",\"\",(J58*K58+L58+M58+N58+O58+P58+Q58+R58+S58+T58+U58+#REF!))","v":""}]
[null,null,null,"","",null,null,null,"",null,null,null,null,null,null,null,null,null,null,null,null,{"$f":"IF(J59=\"\",\"\",(J59*K59+L59+M59+N59+O59+P59+Q59+R59+S59+T59+U59+#REF!))","v":""}]
[null,null,null,"","",null,null,null,"",null,null,null,null,null,null,null,null,null,null,null,null,{"$f":"IF(J60=\"\",\"\",(J60*K60+L60+M60+N60+O60+P60+Q60+R60+S60+T60+U60+#REF!))","v":""}]
[null,null,null,"","",null,null,null,"",null,null,null,null,null,null,null,null,null,null,null,null,{"$f":"IF(J61=\"\",\"\",(J61*K61+L61+M61+N61+O61+P61+Q61+R61+S61+T61+U61+#REF!))","v":""}]
[null,null,null,"","",null,null,null,"",null,null,null,null,null,null,null,null,null,null,null,null,{"$f":"IF(J62=\"\",\"\",(J62*K62+L62+M62+N62+O62+P62+Q62+R62+S62+T62+U62+#REF!))","v":""}]
[null,null,null,"","",null,null,null,"",null,null,null,null,null,null,null,null,null,null,null,null,{"$f":"IF(J63=\"\",\"\",(J63*K63+L63+M63+N63+O63+P63+Q63+R63+S63+T63+U63+#REF!))","v":""}]
[null,null,null,"","",null,null,null,"",null,null,null,null,null,null,null,null,null,null,null,null,{"$f":"IF(J64=\"\",\"\",(J64*K64+L64+M64+N64+O64+P64+Q64+R64+S64+T64+U64+#REF!))","v":""}]
[null,null,null,"","",null,null,null,"",null,null,null,null,null,null,null,null,null,null,null,null,{"$f":"IF(J65=\"\",\"\",(J65*K65+L65+M65+N65+O65+P65+Q65+R65+S65+T65+U65+#REF!))","v":""}]
[null,null,null,"","",null,null,null,"",null,null,null,null,null,null,null,null,null,null,null,null,{"$f":"IF(J66=\"\",\"\",(J66*K66+L66+M66+N66+O66+P66+Q66+R66+S66+T66+U66+#REF!))","v":""}]
[null,null,null,"","",null,null,null,"",null,null,null,null,null,null,null,null,null,null,null,null,{"$f":"IF(J67=\"\",\"\",(J67*K67+L67+M67+N67+O67+P67+Q67+R67+S67+T67+U67+#REF!))","v":""}]
[null,null,null,"","",null,null,null,"",null,null,null,null,null,null,null,null,null,null,null,null,{"$f":"IF(J68=\"\",\"\",(J68*K68+L68+M68+N68+O68+P68+Q68+R68+S68+T68+U68+#REF!))","v":""}]
[null,null,null,"","",null,null,null,"",null,null,null,null,null,null,null,null,null,null,null,null,{"$f":"IF(J69=\"\",\"\",(J69*K69+L69+M69+N69+O69+P69+Q69+R69+S69+T69+U69+#REF!))","v":""}]
[null,null,null,"","",null,null,null,"",null,null,null,null,null,null,null,null,null,null,null,null,{"$f":"IF(J70=\"\",\"\",(J70*K70+L70+M70+N70+O70+P70+Q70+R70+S70+T70+U70+#REF!))","v":""}]
[null,null,null,"","",null,null,null,"",null,null,null,null,null,null,null,null,null,null,null,null,{"$f":"IF(J71=\"\",\"\",(J71*K71+L71+M71+N71+O71+P71+Q71+R71+S71+T71+U71+#REF!))","v":""}]
[null,null,null,"","",null,null,null,"",null,null,null,null,null,null,null,null,null,null,null,null,{"$f":"IF(J72=\"\",\"\",(J72*K72+L72+M72+N72+O72+P72+Q72+R72+S72+T72+U72+#REF!))","v":""}]
[null,null,null,"","",null,null,null,"",null,null,null,null,null,null,null,null,null,null,null,null,{"$f":"IF(J73=\"\",\"\",(J73*K73+L73+M73+N73+O73+P73+Q73+R73+S73+T73+U73+#REF!))","v":""}]
[null,null,null,"","",null,null,null,"",null,null,null,null,null,null,null,null,null,null,null,null,{"$f":"IF(J74=\"\",\"\",(J74*K74+L74+M74+N74+O74+P74+Q74+R74+S74+T74+U74+#REF!))","v":""}]
[null,null,null,{"$f":"IF(A75=\"\",\"\",VLOOKUP(A75,CATALOGO,2,FALSE))","v":""},{"$f":"IF(A75=\"\",\"\",VLOOKUP(A75,CATALOGO,3,FALSE))","v":""},null,null,null,{"$f":"IF(A75=\"\",\"\",VLOOKUP(A75,CATALOGO,4,FALSE))","v":""},null,null,null,null,null,null,null,null,null,null,null,null,{"$f":"IF(J75=\"\",\"\",(J75*K75+L75+M75+N75+O75+P75+Q75+R75+S75+T75+U75+#REF!))","v":""}]
[null,null,null,"","",null,null,null,"",null,null,null,null,null,null,null,null,null,null,null,null,{"$f":"IF(J76=\"\",\"\",(J76*K76+L76+M76+N76+O76+P76+Q76+R76+S76+T76+U76+#REF!))","v":""}]
[null,null,null,"","",null,null,null,"",null,null,null,null,null,null,null,null,null,null,null,null,{"$f":"IF(J77=\"\",\"\",(J77*K77+L77+M77+N77+O77+P77+Q77+R77+S77+T77+U77+#REF!))","v":""}]
[null,null,null,"","",null,null,null,"",null,null,null,null,null,null,null,null,null,null,null,null,{"$f":"IF(J78=\"\",\"\",(J78*K78+L78+M78+N78+O78+P78+Q78+R78+S78+T78+U78+#REF!))","v":""}]
[null,null,null,"","",null,null,null,"",null,null,null,null,null,null,null,null,null,null,null,null,{"$f":"IF(J79=\"\",\"\",(J79*K79+L79+M79+N79+O79+P79+Q79+R79+S79+T79+U79+#REF!))","v":""}]
[null,null,null,"","",null,null,null,"",null,null,null,null,null,null,null,null,null,null,null,null,{"$f":"IF(J80=\"\",\"\",(J80*K80+L80+M80+N80+O80+P80+Q80+R80+S80+T80+U80+#REF!))","v":""}]
[null,null,null,"","",null,null,null,"",null,null,null,null,null,null,null,null,null,null,null,null,{"$f":"IF(J81=\"\",\"\",(J81*K81+L81+M81+N81+O81+P81+Q81+R81+S81+T81+U81+#REF!))","v":""}]
[null,null,null,null,null,null,null,null,null,null,null,null,null,null,null,null,null,null,null,null,null,{"$f":"SUM(V11:V81)","v":500}]

{"sheet":"CENTRO DE COSTOS","index":2,"n_rows":93,"n_cols":20,"rows_kept":93,"cut":false,"hidden":false,"merged":[]}
["CODIGO","NRO","NOMBRE DE ITEM","UNIDAD","PRECIO ESTIMADO","CLASIFICADOR",null,"TECHO ASIGNADO POR AREA, PARA ACTIVIDADES","TECHO ASIGNADO PARA ACTIVIDADES OPERATIVAS (Material de Escritorio)","TECHO ASIGNADO PARA ACTIVIDADES DE REACONDICIONAMIENTO DE INFRAESTRUCTURA","TECHO ASIGNADO PARA ACTIVIDADES, PARA ALAMACENES","TECHO ASIGNADO PARA ACTIVIDADES DE CAJA CHICA","TECHO ASIGNADO PARA ACTIVIDADES DE SERVICIOS BASICOS Y MENSAJERIA","TECHO ASIGNADO PARA EL MANTENIMIENTO DE VEHICULOS Y SOAT","TECHO ASIGNADO PARA LA CONTRATACION DE COMBUSTIBLE Y CARBURANTES","TECHO ASIGNADO PARA LA HABILITACION DE PASAJES Y VIATICOS","TECHO ASIGNADO PARA MANTENIMIENTO DE EQUIPOS","TECHO ASIGNADO PARA ASEO Y TOCADOR","TECHO ASIGNADO PARA CONTRATACION POR TERCEROS","TECHO ASIGNADO PARA RECERVA DE CONTINGENCIA"]
[null,null,"GOBIERNO REGIONAL DE PUNO - UGEL PUNO","CORNEJO MAMANI DAVID GREGORIO"]
[null,null,"DIRECCIÓN GENRAL UGEL PUNO","CORNEJO MAMANI DAVID GREGORIO",null,"2.3. 1 5. 3 1",null,42500,0]
["1434.01.01",1,"DIRECCION GENERAL","CORNEJO MAMANI DAVID GREGORIO",31962,"2.3. 1 5. 3 1",null,null,889.19999999999993]
["1434.01.02",2,"SECRETARIA DIRECCIÓN","FLORES CANO YUSEY DEL PILAR YASMIN",136,"2.3. 1 5. 3 1",null,null,1134.252,null,null,{"$f":"1500*12","v":18000}]
["1434.01.03",3,"TRAMITE DOCUMENTARIO","FORAQUITAGUZMANJUANA SONIA ROXANA",2959,"2.3. 1 5. 3 1",null,null,889.23599999999999,null,null,null,1000]
["1434.01.04",4,"IMAGEN INSTITUCIONAL","GORDILLOHERMOSACARLOS",11529,null,null,null,677.73599999999999]
["1434.01.05",5,"ACTAS Y CERTIFICADOS","TURPOVILCASIMON",302,null,null,null,677.73599999999999]
["1434.01.06",6,"SECRETARIO TECNICO COPROA","TACCAPUMACAJIAEFRAIN",1593,null,null,null,677.73599999999999]
[null,null,"ÁREA DE ASESORIA JURIDICA","CRUZMAMANIFLAVIO",null,null,null,11000,0]
["1434.02.01",7,"JEFE DE ASESORIA JURIDICA","CRUZMAMANIFLAVIO",343,null,null,null,889.23599999999999]
["1434.02.02",8,"SECRETARIA OAJ","DUEÑASZEAGERMAN",null,null,null,null,1134.252]
["1434.02.03",9,"ABOGADO I","BAILONARIALFREDO",null,null,null,null,683.41199999999992]
[null,null,"ORGANO DE CONTROL INSTITUCIONAL","GALLEGOSVARGASOSWALDO COSME",null,null,null,9000,0]
["1434.03.01",10,"ORGANO DE CONTROL INSTITUCIONAL","GALLEGOSVARGASOSWALDO COSME",269,null,null,null,855.18]
["1434.03.02",11,"SECRETARIA II - OCI","CHAVEZMOLINAMARIA LIVIA",null,null,null,null,1134.252]
["1434.03.03",12,"AUDITOR","AROAPAZAQUISPERUBY ALBERTO",null,null,null,null,677.73599999999999]
[null,null,"ÄREA DE GESTION ADMINISTRATIVA","PANIURAQUISPEMARIA ROSA",null,null,null,28500,0]
["1434.04.01",13,"JEFE DE AGA","PANIURAQUISPEMARIA ROSA",36480,null,null,null,860.85599999999999,null,null,null,null,null,null,35000,null,null,18000]
["1434.04.02",14,"SECRETARIA ADMINISTRACION","PACOMPIAPAUCARFLORA",825,null,null,null,1134.252,null,null,null,28000]
["1434.04.03",15,"OFICINA DE ABASTECIMIENTOS","QUISPEFRISANCHOELAR PABLO",38222,null,null,null,906.99599999999998,null,null,null,null,22000,30000]
["1434.04.04",16,"OFICINA DE CONTABILIDAD","APAZAROJASJAVIER",7614,null,null,null,906.99599999999998]
["1434.04.05",17,"TESORERIA","GUERRAMARTINEZLIZARDO FULGENCIO",14178,null,null,null,906.99599999999998]
["1434.04.06",18,"ESPECIALISTA EN PERSONAL","ZAPANAPINEDATEODINA ELENA",4126,null,null,null,889.23599999999999]
["1434.04.07",19,"SECRETARIA OFICNA DE PERSONAL","MATAMETMELOMARY VICENTA",null,null,null,null,1134.252]
["1434.04.08",20,"SERVICIO DE TRANSPORTES I","FLORESCONDORIJESUS MARCIAL",9356,null,null,null,360]
["1434.04.09",21,"SERVICIO DE LIMPIEZA","MAQUERAFLORESMARCELINO",285,null,null,null,677.73599999999999]
["1434.04.10",22,"ALMACEN","MAMANILUQUEMARWIN",14675,null,null,null,906.99599999999998,null,18000]
["1434.04.11",23,"PATRIMONIO","JAMACHIARPASINORMA SOLEDAD",1225,null,null,null,706.84799999999996,null,null,null,null,null,null,null,1200]
["1434.04.12",24,"CAJA","MAQUERAFLORESMARCELINO",18734,null,null,null,677.73599999999999]
["1434.04.13",25,"IMPRESIONES","CUTIPAHUARCAYACLAUDIO",1999,null,null,null,278.23200000000003,null,null,null,null,null,null,null,null,10000]
["1434.04.14",26,"ESPECIALISTA EN INFORMATICA","CCOPALAUREANOPATRICIA",4900,null,null,null,600]
["1434.04.15",27,"PROYECTO RESOLUCIONES","VILCAMORALESCONCEPCION",null,null,null,null,677.73599999999999]
["1434.04.16",28,"OPERADOR PAD","RAMOSQUISPEMERY ROXANA",null,null,null,null,694.76400000000001]
["1434.04.17",29,"BIENESTAR SOCIAL","TAPIAHUACASIAZALIA",9126,null,null,null,677.73599999999999]
["1434.04.18",30,"ESCALAFON","CORACAHUANAHERMILIO",18716,null,null,null,677.73599999999999]
["1434.04.19",31,"ESPECIALISTA EN ESCALAFON",null,null,null,null,null,0]
["1434.04.20",32,"REMUNERACIONES","GOMEZACHOCALLACELIA",8952,null,null,null,677.73599999999999]
["1434.04.21",33,"ESPECIALISTA EN REMUNERACIONES","CAHUANATICONAWALTER DUVERLIH",null,null,null,null,600]
["1434.04.22",34,"ESPECIALISTA EN ALMACEN","QUISPEFRISANCHOELAR PABLO",1197,null,null,null,0]
["1434.04.23",35,"TECNICO EN ABASTECIMIENTO","CONZAPADILLOLUIS FERNANDO",null,null,null,null,600]
["1434.04.24",36,"TECNICO EN ESCALAFON","CCOPALAUREANOPATRICIA",null,null,null,null,0]
["1434.04.25",37,"SERVICIO DE TRANSPORTE","AYALAMURGAJUAN",null,null,null,null,360]
["1434.04.26",38,"SERVICIO DE TRANSPORTES II","HUARCAYACOACCALLALENIN",null,null,null,null,360]
["1434.04.27",39,"SERVICIO DE TRANSPORTES III","VELASQUEZCOILAJUAN PASTOR",null,null,null,null,360]
[null,null,"ÄREA DE GESTION PEDAGÓGICA","CHOQUECOPARIRENE",null,null,null,null,0]
["1434.05.01",40,"JEFE DE AGP","CHOQUECOPARIRENE",58181,null,null,null,889.23599999999999]
["1434.05.02",41,"SECRETARIA AGP","PALOMAMAYTAVILMA",285,null,null,null,450]
["1434.05.03",42,"ESPECIALISTA EN EDUCACION INICIAL","GUEVARAPINEDARUTH YENY",400,null,null,null,450]
["1434.05.04",43,"ESPECIALISTA EN EDUCACION PRIMARIA - I","HUARACHAORTEGAMARICELA JOVANA",235,null,null,null,450]
["1434.05.05",44,"ESPECIALISTA EN MATEMATICA","RAMOSALIAGANOEMI YESENIA",2305,null,null,null,450]
["1434.05.06",45,"ESPECIALISTA EN COMUNICACION","MELOQUISPERICARDO",null,null,null,null,450]
["1434.05.07",46,"ESPECIALISTA EN CTA","QUESADAVELEZPERCY",9396,null,null,null,450]
["1434.05.08",47,"ESPECIALISTA EN CC.SS","CHALCOUGARTEMAXIMILIANO",101,null,null,null,450]
["1434.05.09",48,"ESPECIALISTA EN EDUCACION FISICA","MANSILLAPARIMARCO ADRIAN",7928,null,null,null,450]
["1434.05.10",49,"ESPECIALISTA EN TOE","NUÑEZAROAPAZADAYME ADALID",195,null,null,null,450]
["1434.05.11",50,"ESPECIALISTA EN CETPRO","HUANCAMENDOZAJESUS FORTUNATO",585,null,null,null,450]
["1434.05.12",51,"ESPECIALISTA EN EDUCACION EIB- RURAL","FLORESCAHUANAYANED",639,null,null,null,450]
["1434.05.13",52,"ASISTENTE DE SERVICIO EDUCACION Y CULTURA","COAQUIRAAPAZAMIRIAM VERONICA",2843,null,null,null,450]
["1434.05.14",53,"GESTOR LOCAL PELA","ORTEGAGUZMANMILAGROS JANET",13566,null,null,null,450]
["1434.05.15",54,"ESPECIALISTA EN TIC","VASQUEZCANSAYALUIS CESAR",null,null,null,null,450]
["1434.05.16",55,"COORDINADOR LOCAL DE PREVAED","ZEAHUARAYACARLOS",null,null,null,null,450]
["1434.05.17",56,"ESPECIALISTA EN FORMACIÓN CIUDADANA Y CIVICA","LAQUILAIMEEDWIN",null,null,null,null,450]
["1434.05.18",57,"ESPECIALISTA EN ALFABETIZACION","NUÑEZAROAPAZADAYME ADALID",null,null,null,null,450]
["1434.05.19",58,"ESPECIALISTA EN CEBA","LARICOCHALLCHAANTONIO SANTIAGO",null,"2.3. 1 5. 1 2",null,null,450]
["1434.05.20",59,"ESPECIALISTA INGLES","PONCEFUENTESYOVANA FLORINDA",null,"2.3. 1 5. 1 2",null,null,450]
["1434.05.21",60,"ESPECIALISTA EPT","CCORITIPOGERMAN",null,"2.3. 1 5. 1 2",null,null,450]
["1434.05.22",61,"ESPECIALISTA EN PRONOEI","GONZALOVILCAPAZABEATRIZ",null,"2.3. 1 5. 1 2",null,null,450]
["1434.05.23",62,"RESPONSABLE L. C. INFORMACIÓN - PELA","FLORESQUISPEJOSE LOLO",null,"2.3. 1 5. 1 2",null,null,450]
["1434.05.24",63,"ESPECIALISTA EN EDUCACION PRIMARIA - II","VELASQUEZPEDRAZACORINA VILMA",null,"2.3. 1 5. 1 2",null,null,450]
["1434.05.25",64,"ESPECIALISTA EN CONVIVENCIA ESCOLAR","MACEDOARGANDOÑAHAYDEE",null,"2.3. 1 5. 1 2",null,null,450]
[null,null,"AREA DE GESTION INSTITUCIONAL","VALERIANOVALDEZMARIO MARIANO",null,"PAPEL LUSTRE DE 60 cm X 50 cm COLOR AZUL",null,31950,0]
["1434.06.01",65,"JEFATURA AGI","VALERIANOVALDEZMARIO MARIANO",51508,"PAPEL LUSTRE DE 50 cm X 65 cm COLOR ROJO",null,null,855.18]
["1434.06.02",66,"SECRETARIA AGI","MOLLOCONDOCHOQUENORMA",null,"PAPEL LUSTRE DE 50 cm X 65 cm COLOR AZUL",null,null,1134.252]
["1434.06.03",67,"PLANIFICADOR","CACERESMAMANICELEDONIO NAZARIO",null,"PAPEL LUSTRE DE 50 cm X 65 cm COLOR AMARILLO",null,null,677.73599999999999]
["1434.06.04",68,"ESPECIALISTA EN ESTADISTICA","IGNACIOVELAZCOPAUL",2909,"PAPEL LUSTRE DE 50 cm X 65 cm COLOR VERDE",null,null,677.73599999999999]
["1434.06.05",69,"ESPECILISTA EN PRESUPUESTO Y FINAZAS","ANCCORAMOSALIPIO RODRIGO",null,"PAPEL LUSTRE DE 50 cm X 65 cm COLOR CELESTE",null,null,855.18,null,null,null,null,null,null,null,null,null,null,71058]
["1434.06.06",70,"ESPECIALISTA EN RACIONALIZACION","MORANNPERCAMAGUIN",null,"PAPEL LUSTRE DE 60 cm X 50 cm COLOR CELESTE",null,null,677.73599999999999,22200]
["1434.06.07",71,"ESPECIALISTA EN INFRAESTRUCTURA","FERNANDEZGUTIERREZGUSTAVO VICTOR",null,"PAPEL LUSTRE DE 60 cm X 50 cm COLOR NARANJA",null,null,677.57999999999993]
["1434.06.08",72,"RESPONSABLE DEL PROGRAMA ACCESO","CACERESMAMANICELEDONIO NAZARIO",320,"PAPEL LUSTRE DE 60 cm X 50 cm COLOR LILA",null,null,0]
["1434.06.09",73,"DIR. SISTEMA ADM. I","GONZALESARESTEGUIJULIO REYNALDO",null,"PAPEL LUSTRE DE 60 cm X 50 cm COLOR MORADO",null,null,677.73599999999999]
["1434.06.10",74,"ESPECIALISTA DE MANTENIMIENTO DE LOCALES","MARCALIMACHINESTOR",null,"PAPEL LUSTRE DE 60 cm X 50 cm COLOR GUINDA",null,null,677.73599999999999]
["1434.06.11",75,"ESPECIALISTA IIEE. PRIVADAS","BENITOLOPEZROXANA",null,null,null,null,677.73599999999999]
[null,null,null,"FLORES TICONA JAVIUER",null,null,null,null,677.73599999999999]
[null,null,null,"JUAN WASHINTON VARGAS CASTILLO",null,null,null,null,600]
[null,null,null,"CLINIO TUCO FERNANDEZ",null,null,null,null,600]
[]
[]
[null,null,null,null,null,null,null,{"$f":"+H72+H18+H14+H10+H3","v":122950},{"$f":"SUM(I2:I87)","v":48108.383999999984},{"$f":"SUM(J2:J87)","v":22200},{"$f":"SUM(K2:K87)","v":18000},18000,29000,22000,30000,35000,1200,10000,18000,71058]
[]
[null,null,null,null,null,null,null,{"$f":"SUM(H89:T89)","v":445516.38399999996}]
[]
[null,null,null,null,null,null,null,{"$f":"+H91-494261","v":-48744.616000000038}]

{"sheet":"CATALOGO","index":3,"n_rows":580,"n_cols":6,"rows_kept":580,"cut":false,"hidden":false,"merged":[]}
["N°","CODIGO","NOMBRE DE ITEM","UNIDAD","PRECIO ESTIMADO","CLASIFICADOR"]
[1,"133000410156","ALCOHOL SPRAY X 400 mL","UNIDAD",12]
[2,"133000140205","AMBIENTADOR EN PASTILLA PARA BAÑO X 40 gr APROX.","UNIDAD",7,"2.3. 1 5. 3 1"]
[3,"133000140079","AMBIENTADOR EN SPRAY X 360 mL","UNIDAD",7,"2.3. 1 5. 3 1"]
[4,"133000140077","AMBIENTADOR EN SPRAY X 400 mL APROX.","UNIDAD",7,"2.3. 1 5. 3 1"]
[5,"133000140091","AMBIENTADOR EN SPRAY X 650 mL","UNIDAD",7,"2.3. 1 5. 3 1"]
[6,"710600010009","ARCHIVADOR DE CARTON CON PALANCA LOMO ANCHO TAMAÑO MEDIO OFICIO","UNIDAD",4,"2.3. 1 5. 3 1"]
[7,"710600010012","ARCHIVADOR DE CARTON CON PALANCA LOMO ANCHO TAMAÑO OFICIO","UNIDAD",3.66,"2.3. 1 5. 3 1"]
[8,"710600010014","ARCHIVADOR DE CARTON CON PALANCA LOMO ANGOSTO TAMAÑO MEDIO OFICIO","UNIDAD",4,"2.3. 1 5. 3 1"]
[9,"283400060097","BATERIA 13 PLACAS 12 V 75 A","UNIDAD",335,"2.3. 1 5. 3 1"]
[10,"283400060228","BATERIA 15 PLACAS 12 V 1000 A","UNIDAD",320,"2.3. 1 5. 3 1"]
[11,"716000010022","BOLIGRAFO (LAPICERO) DE TINTA LIQUIDA PUNTA FINA COLOR  AZUL","UNIDAD",2.8,"2.3. 1 5. 3 1"]
[12,"716000010001","BOLIGRAFO (LAPICERO) DE TINTA LIQUIDA PUNTA FINA COLOR  NEGRO","UNIDAD",2.8,"2.3. 1 5. 3 1"]
[13,"716000010002","BOLIGRAFO (LAPICERO) DE TINTA LIQUIDA PUNTA FINA COLOR  ROJO","UNIDAD",2.8,"2.3. 1 5. 1 2"]
[14,"716000010196","BOLIGRAFO (LAPICERO) DE TINTA SECA PUNTA MEDIA","UNIDAD",0.77,"2.3. 1 3. 1 1"]
[15,"716000010212","BOLIGRAFO (LAPICERO) DE TINTA SECA PUNTA MEDIA COLOR  AZUL","UNIDAD",0.4]
[16,"716000010213","BOLIGRAFO (LAPICERO) DE TINTA SECA PUNTA MEDIA COLOR  NEGRO","UNIDAD",0.4,"2.3. 1 9. 1 2"]
[17,"716000010214","BOLIGRAFO (LAPICERO) DE TINTA SECA PUNTA MEDIA COLOR  ROJO","UNIDAD",0.4,"2.3. 1 9. 1 2"]
[18,"716000010222","BOLIGRAFO (LAPICERO) DE TINTA SECA PUNTA MEDIA COLOR AZUL","EMPAQUE X 50",24,"2.3. 1 9. 1 2"]
[19,"716000010223","BOLIGRAFO (LAPICERO) DE TINTA SECA PUNTA MEDIA COLOR ROJO.","EMPAQUE X 50",24,"2.3. 1 9. 1 2"]
[20,"711100010028","BORRADOR BLANCO PARA LAPIZ TAMAÑO CHICO","UNIDAD",0.37,"2.3. 1 9. 1 2"]
[21,"711100010008","BORRADOR MIXTO TAMAÑO GRANDE","UNIDAD",0.8,"2.3. 1 9. 1 2"]
[22,"717300110160","CARTON PRENSADO N° 8 DE 70 cm X 100 cm","UNIDAD",8,"2.3. 1 9. 1 2"]
[23,"717300110328","CARTULINA CORRUGADA 100 g DE 50 cm X 70 cm DE COLOR","UNIDAD",0.24,"2.3. 1 9. 1 2"]
[24,"717300110043","CARTULINA PLASTIFICADA DE 50 cm X 60 cm","UNIDAD",0.24]
[25,"717300110094","CARTULINA PLASTIFICADA DE 50 cm X 65 cm COLOR AZUL","UNIDAD",0.24,"2.3. 1 5. 1 2"]
[26,"717300110188","CARTULINA SATINADA 150 g  DE 70 cm X 100 cm","UNIDAD",0.5,"2.3. 1 5. 1 2"]
[27,"717300110032","CARTULINA SATINADA 150 g DE 50 cm X 65 cm","UNIDAD",0.5,"2.3. 1 5. 1 2"]
[28,"717300110332","CARTULINA SATINADA 150 g DE 50 cm X 65 cm  COLOR BLANCO","CIENTO",0.5,"2.3. 1 5. 1 2"]
[29,"717300110097","CARTULINA SATINADA 150 g DE 50 cm X 65 cm COLOR BLANCO","UNIDAD",0.5,"2.3. 1 5. 1 2"]
[30,"717300110165","CARTULINA SATINADA 150 g DE 50 cm X 65 cm COLOR NEGRO","UNIDAD",0.5,"2.3. 1 5. 1 2"]
[31,"717300110042","CARTULINA SATINADA 150 g DE 70 cm X 100 cm COLOR BLANCO","UNIDAD",0.5,"2.3. 1 5. 1 2"]
[32,"717300110089","CARTULINA SIMPLE 120 g DE 70 cm X 100 cm COLOR BLANCO","UNIDAD",0.3,"2.3. 1 5. 1 2"]
[33,"717300110329","CARTULINA SIMPLE 140 g 50 cm X 65 cm COLOR BLANCO","UNIDAD",0.31859999999999999,"2.3. 1 5. 1 2"]
[34,"717300110331","CARTULINA SIMPLE 140 g 50 cm X 65 cm COLOR NEGRO","UNIDAD",0.31859999999999999,"2.3. 1 5. 1 2"]
[35,"717300110403","CARTULINA SIMPLE 140 g 50 cm X 65 cm COLOR RAL 1016","UNIDAD",0.255,"2.3. 1 5. 1 2"]
[36,"717300110404","CARTULINA SIMPLE 140 g 50 cm X 65 cm COLOR RAL 5015","UNIDAD",0.25509999999999999,"2.3. 1 5. 1 2"]
[37,"717300110405","CARTULINA SIMPLE 140 g 50 cm X 65 cm COLOR RAL 6001","UNIDAD",0.25509999999999999,"2.3. 1 5. 1 2"]
[38,"717300110330","CARTULINA SIMPLE 140 g 50 cm X 65 cm DE COLORES","UNIDAD",0.3,"2.3. 1 5. 1 2"]
[39,"717300110270","CARTULINA SIMPLE 145 g DE 50 cm X 56 cm COLOR AMARILLO","UNIDAD",0.3,"2.3. 1 5. 1 2"]
[40,"717300110266","CARTULINA SIMPLE 145 g DE 50 cm X 56 cm COLOR BLANCO","UNIDAD",0.3,"2.3. 1 5. 1 2"]
[41,"717300110268","CARTULINA SIMPLE 145 g DE 50 cm X 56 cm COLOR CELESTE","UNIDAD",0.3,"2.3. 1 5. 1 2"]
[42,"717300110267","CARTULINA SIMPLE 145 g DE 50 cm X 56 cm COLOR ROSADO","UNIDAD",0.3,"2.3. 1 5. 1 2"]
[43,"717300110269","CARTULINA SIMPLE 145 g DE 50 cm X 56 cm COLOR VERDE","UNIDAD",0.3,"2.3. 1 5. 1 2"]
[44,"717300110337","CARTULINA SIMPLE 145 g DE 50 cm X 65 cm COLOR BLANCA","UNIDAD",0.3,"2.3. 1 5. 1 2"]
[45,"717300110363","CARTULINA SIMPLE 145 g TAMAÑO  A4","CIENTO",3,"2.3. 1 5. 1 2"]
[46,"717300110342","CARTULINA SIMPLE 150 g 70 cm X 100 cm COLOR AMARILLO","UNIDAD",0.4,"2.3. 1 5. 1 2"]
[47,"717300110002","CARTULINA SIMPLE 150 g DE 50 cm X 65 cm","UNIDAD",0.4,"2.3. 1 5. 1 2"]
[48,"717300110034","CARTULINA SIMPLE 150 g DE 50 cm X 65 cm COLOR AMARILLO","UNIDAD",0.4,"2.3. 1 5. 1 2"]
[49,"717300110226","CARTULINA SIMPLE 150 g DE 50 cm X 65 cm COLOR AZUL","UNIDAD",0.4,"2.3. 1 5. 1 2"]
[50,"717300110035","CARTULINA SIMPLE 150 g DE 50 cm X 65 cm COLOR BLANCO","UNIDAD",0.4,"2.3. 1 5. 1 2"]
[51,"717300110036","CARTULINA SIMPLE 150 g DE 50 cm X 65 cm COLOR CELESTE","UNIDAD",0.4,"2.3. 1 5. 1 2"]
[52,"717300110313","CARTULINA SIMPLE 150 g DE 50 cm X 65 cm COLOR MARRÓN","UNIDAD",0.4,"2.3. 1 5. 1 2"]
[53,"717300110135","CARTULINA SIMPLE 150 g DE 50 cm X 65 cm COLOR ROJO","UNIDAD",0.4,"2.3. 1 5. 1 2"]
[54,"717300110092","CARTULINA SIMPLE 150 g DE 50 cm X 65 cm COLOR ROSADO","UNIDAD",0.4,"2.3. 1 5. 1 2"]
[55,"717300110091","CARTULINA SIMPLE 150 g DE 50 cm X 65 cm COLOR VERDE","UNIDAD",0.4,"2.3. 1 5. 1 2"]
[56,"717300110285","CARTULINA SIMPLE 150 g DE 70 cm X 100 cm COLOR BLANCO","CIENTO",3,"2.3. 1 5. 1 2"]
[57,"717300110019","CARTULINA SIMPLE 150 g TAMAÑO A4","CIENTO",3,"2.3. 1 5. 1 2"]
[58,"717300110125","CARTULINA SIMPLE 150 g TAMAÑO A5 COLOR AMARILLO","UNIDAD",0.5,"2.3. 1 5. 1 2"]
[59,"717300110121","CARTULINA SIMPLE 150 g TAMAÑO A5 COLOR BLANCO","UNIDAD",0.5,"2.3. 1 5. 1 2"]
[60,"717300110123","CARTULINA SIMPLE 150 g TAMAÑO A5 COLOR CELESTE","UNIDAD",0.5,"2.3. 1 5. 1 2"]
[61,"717300110122","CARTULINA SIMPLE 150 g TAMAÑO A5 COLOR ROSADO","UNIDAD",0.5,"2.3. 1 5. 1 2"]
[62,"717300110124","CARTULINA SIMPLE 150 g TAMAÑO A5 COLOR VERDE","UNIDAD",0.5,"2.3. 1 5. 1 2"]
[63,"717300110039","CARTULINA SIMPLE 160 g DE 50 cm X 65 cm","UNIDAD",0.4,"2.3. 1 5. 1 2"]
[64,"717300110013","CARTULINA SIMPLE 160 g DE 61 cm X 86 cm","UNIDAD",0.4,"2.3. 1 5. 1 2"]
[65,"717300110070","CARTULINA SIMPLE 160 g DE 65 cm X 50 cm COLOR NEGRO","UNIDAD",0.4,"2.3. 1 5. 1 2"]
[66,"717300110009","CARTULINA SIMPLE 165 g DE 65 cm X 50 cm","UNIDAD",0.4,"2.3. 1 5. 1 2"]
[67,"717300110075","CARTULINA SIMPLE 165 g DE 65 cm X 50 cm COLOR BLANCO","UNIDAD",0.4,"2.3. 1 5. 1 2"]
[68,"717300110086","CARTULINA SIMPLE 170 g  DE 70 cm X 100 cm COLOR CELESTE","CIENTO",0.4,"2.3. 1 5. 1 2"]
[69,"717300110051","CARTULINA SIMPLE 180 g DE 100 cm X 70 cm COLOR ROSADO","UNIDAD",0.4,"2.3. 1 5. 1 2"]
[70,"717300110098","CARTULINA SIMPLE 180 g DE 50 cm X 65 cm COLOR CELESTE","UNIDAD",0.4,"2.3. 1 5. 1 2"]
[71,"717300110099","CARTULINA SIMPLE 180 g DE 50 cm X 65 cm COLOR ROSADO","UNIDAD",0.4,"PAPEL LUSTRE DE 60 cm X 50 cm COLOR AZUL"]
[72,"717300110014","CARTULINA SIMPLE 180 g DE 61 cm X 86 cm","UNIDAD",0.4,"PAPEL LUSTRE DE 50 cm X 65 cm COLOR ROJO"]
[73,"717300110095","CARTULINA SIMPLE 180 g DE 69 cm x 89 cm COLOR  CELESTE","EMPAQUE X 500",0.4,"PAPEL LUSTRE DE 50 cm X 65 cm COLOR AZUL"]
[74,"717300110085","CARTULINA SIMPLE 180 g DE 69 cm X 89 cm COLOR ROSADO","CIENTO",0.4,"PAPEL LUSTRE DE 50 cm X 65 cm COLOR AMARILLO"]
[75,"717300110084","CARTULINA SIMPLE 180 g DE 69 cm X 89 cm COLOR VERDE","CIENTO",0.4,"PAPEL LUSTRE DE 50 cm X 65 cm COLOR VERDE"]
[76,"717300110047","CARTULINA SIMPLE 180 g DE 70 cm X 100 cm COLOR  BLANCO","UNIDAD",0.4,"PAPEL LUSTRE DE 50 cm X 65 cm COLOR CELESTE"]
[77,"717300110046","CARTULINA SIMPLE 180 g DE 70 cm X 100 cm COLOR ROSADO","CIENTO",0.4,"PAPEL LUSTRE DE 60 cm X 50 cm COLOR CELESTE"]
[78,"717300110003","CARTULINA SIMPLE 180 g TAMAÑO A4","UNIDAD",0.3,"PAPEL LUSTRE DE 60 cm X 50 cm COLOR NARANJA"]
[79,"717300110005","CARTULINA SIMPLE 220 g DE 66 cm X 102 cm","UNIDAD",0.3,"PAPEL LUSTRE DE 60 cm X 50 cm COLOR LILA"]
[80,"717300110004","CARTULINA SIMPLE 220 g DE 70 cm X 100 cm","UNIDAD",0.3,"PAPEL LUSTRE DE 60 cm X 50 cm COLOR MORADO"]
[81,"717300110012","CARTULINA SIMPLE 90 g DE 70 cm X 100 cm","UNIDAD",0.3,"PAPEL LUSTRE DE 60 cm X 50 cm COLOR GUINDA"]
[82,"717300120003","CARTULINA TIPO CANSON 150 g DE 50 cm X 65 cm","UNIDAD",1.5]
[83,"717300110130","CARTULINA TIPO TAGG 150 g DE 23.2 cm X 32.5 cm","UNIDAD",0.3]
[84,"767400040059","CD GRABABLE DE 700 MB","UNIDAD",0.3]
[85,"133000070031","CERA AL AGUA AUTOBRILLANTE COLOR NEUTRAL","GALON",25]
[86,"133000070049","CERA AL AGUA AUTOBRILLANTE COLOR NEUTRAL X 20 L","UNIDAD",25]
[87,"133000070046","CERA AL AGUA PARA PISO AUTOBRILLANTE COLOR AMARILLO","GALON",25]
[88,"133000070047","CERA AL AGUA PARA PISO AUTOBRILLANTE COLOR NEGRO","GALON",25]
[89,"133000070045","CERA AL AGUA PARA PISO AUTOBRILLANTE COLOR ROJO","GALON",25]
[90,"133000070037","CERA AL AGUA PARA PISO COLOR AMARILLO","GALON",25]
[91,"133000070035","CERA AL AGUA PARA PISO COLOR BLANCO","GALON",25]
[92,"133000070036","CERA AL AGUA PARA PISO COLOR NEGRO","GALON",25]
[93,"133000070034","CERA AL AGUA PARA PISO COLOR ROJO","GALON",25]
[94,"133000070038","CERA AL AGUA PARA PISO X 5 L","UNIDAD",25]
[95,"133000070010","CERA AL AGUA PARA PISO X 55 gal","UNIDAD",25]
[96,"133000070032","CERA AL AGUA PARA PISO.","GALON",25]
[97,"133000070025","CERA AL AGUA PERFUMADA X 1 L","UNIDAD",7]
[98,"133000070048","CERA AL AGUA PERFUMADA.","GALON",25]
[99,"133000070053","CERA LÍQUIDA CON SILICONA PARA PISO COLOR ROJO X 1 gal","UNIDAD",21]
[100,"133000070056","CERA LÍQUIDA CON SILICONA PARA PISO X 1 gal","UNIDAD",21]
[101,"133000070054","CERA LÍQUIDA PARA PISO AUTOBRILLANTE COLOR BLANCO","GALON",25]
[102,"133000070043","CERA LIQUIDA PARA PISO COLOR ROJO","GALON",25]
[103,"133000070042","CERA LIQUIDA PARA PISO X 1 gal","UNIDAD",21]
[104,"710300010010","CINTA ADHESIVA TRANSPARENTE 2 in X 72 yd","UNIDAD",3.2]
[105,"710300160013","CINTA DE PAPEL PARA ENMASCARAR - MASKING TAPE 1 1/2 in X 40 yd","UNIDAD",3.9]
[106,"710300160049","CINTA DE PAPEL PARA ENMASCARAR - MASKING TAPE 1 in X 36 yd","UNIDAD",2.2999999999999998]
[107,"710300160006","CINTA DE PAPEL PARA ENMASCARAR - MASKING TAPE 2 in X 40 yd","UNIDAD",4.4000000000000004]
[108,"710300160071","CINTA DE PAPEL PARA ENMASCARAR - MASKING TAPE 3 1/4 in X 40 yd","UNIDAD",1.54]
[109,"710300160018","CINTA DE PAPEL PARA ENMASCARAR - MASKING TAPE 3/4 in X 25 yd","UNIDAD",1.66]
[110,"710300160017","CINTA DE PAPEL PARA ENMASCARAR - MASKING TAPE 3/4 in X 40 yd","UNIDAD",1.98]
[111,"718500050045","CLIP DE METAL 33 mm","UNIDAD",0.86140000000000005]
[112,"718500050032","CLIP DE METAL 33 mm X 100","UNIDAD",0.96760000000000002]
[113,"718500050001","CLIP DE METAL CHICO Nº 1 X 100","UNIDAD",0.63719999999999999]
[114,"718500050030","CLIP MARIPOSA DE METAL Nº 2 X 12","UNIDAD",1.7372000000000001]
[115,"718500050004","CLIP MARIPOSA DE METAL Nº 3 X 12","UNIDAD",2.4]
[116,"718500050017","CLIP MARIPOSA DE METAL Nº 3 X 50","UNIDAD",3.056]
[117,"737000010033","COLA SINTETICA X 250 g","UNIDAD",1.55]
[118,"239400090220","CONO DE PLÁSTICO PARA ENTRENAMIENTO 30 cm","UNIDAD",3.8]
[119,"711100030005","CORRECTOR LIQUIDO TIPO LAPICERO","UNIDAD",2.5]
[120,"890400010045","CORROSPUN 1.00 m X 1.00 m","UNIDAD",8.9]
[121,"890400010151","CORROSPUN 1.00 m X 1.00 m COLOR AMARILLO","UNIDAD",10.5]
[122,"890400010152","CORROSPUN 1.00 m X 1.00 m COLOR CELESTE","UNIDAD",10.5]
[123,"890400010150","CORROSPUN 1.00 m X 1.00 m COLOR FUCSIA","UNIDAD",10.5]
[124,"890400010153","CORROSPUN 1.00 m X 1.00 m COLOR VERDE CLARO","UNIDAD",10.5]
[125,"890400010187","CORROSPUN 1.40 m X 1.80 m COLOR AMARILLO","UNIDAD",8.9]
[126,"890400010192","CORROSPUN 1.40 m X 1.80 m COLOR FUCSIA","UNIDAD",8.9]
[127,"890400010191","CORROSPUN 1.40 m X 1.80 m COLOR MARRON","UNIDAD",8.9]
[128,"890400010189","CORROSPUN 1.40 m X 1.80 m COLOR NEGRO","UNIDAD",8.9]
[129,"890400010190","CORROSPUN 1.40 m X 1.80 m COLOR ROJO","UNIDAD",8.9]
[130,"890400010186","CORROSPUN 1.40 m X 1.80 m COLOR VERDE","UNIDAD",8.9]
[131,"890400010188","CORROSPUN 1.40 m X 1.80 m COLOR VERDE CLARO","UNIDAD",8.9]
[132,"890400010163","CORROSPUN DE 1.00 m X 1.50 m","UNIDAD",8.9]
[133,"890400010082","CORROSPUN DE 1.40 m X 1.00 m","UNIDAD",8.9]
[134,"890400010067","CORROSPUN DE 70 cm X 50 cm","UNIDAD",4]
[135,"890400010110","CORROSPUN DE 70 cm X 50 cm COLOR ROSADO","UNIDAD",4]
[136,"890400010178","CORROSPUN X 1.50 m DE ANCHO","METRO",8.9]
[137,"890400010177","CORROSPUN X 1.80 m DE ANCHO","UNIDAD",8.9]
[138,"890400010165","CORROSPUN X 2.00 m DE ANCHO","METRO",8.9]
[139,"890400010074","CORROSPUN X 70 cm DE ANCHO COLOR BLANCO","METRO",8.9]
[140,"890400010174","CORROSPUN X 70 cm DE ANCHO COLOR DORADO","METRO",8.9]
[141,"890400010072","CORROSPUN X 70 cm DE ANCHO COLOR MARRON","METRO",8.9]
[142,"890400010070","CORROSPUN X 70 cm DE ANCHO COLOR NEGRO","METRO",8.9]
[143,"890400010175","CORROSPUN X 70 cm DE ANCHO COLOR PLATEADO","METRO",8.9]
[144,"890400010071","CORROSPUN X 70 cm DE ANCHO COLOR ROJO","METRO",8.9]
[145,"890400010073","CORROSPUN X 70 cm DE ANCHO COLOR VERDE","METRO",8.9]
[146,"890400010075","CORROSPUN X 70 CM DE ANCHO COLOR VERDE CLARO","METRO",8.9]
[147,"717200030014","CUADERNO CUADRICULADO TAMAÑO A4 X 100 HOJAS","UNIDAD",4.95]
[148,"717200030287","CUADERNO DOBLE ESPIRAL CUADRICULADO TAMAÑO A4 X 180 HOJAS","UNIDAD",6.07]
[149,"715000320033","CUCHILLA PARA CORTAR PAPEL 10 mm","UNIDAD",1.1200000000000001]
[150,"715000320027","CUCHILLA PARA CORTAR PAPEL CON MANGO DE PLASTICO","UNIDAD",8]
[151,"135000040013","DESATORADOR DE JEBE PARA SERVICIOS HIGIENICOS DE 6 in","UNIDAD",7]
[152,"133000120055","DESINFECTANTE LIMPIADOR AROMATICO X 1 gal","UNIDAD",10]
[153,"133000160091","DETERGENTE GRANULADO X 3 kg","UNIDAD",22]
[154,"133000160140","DETERGENTE GRANULADO X 350 g APROX.","UNIDAD",3.5]
[155,"133000160124","DETERGENTE GRANULADO X 4 kg","UNIDAD",49]
[156,"133000160100","DETERGENTE GRANULADO X 4.5 kg","UNIDAD",55]
[157,"133000160086","DETERGENTE GRANULADO X 5 kg","UNIDAD",30]
[158,"767400040151","DISCO  DVD - RW 4 GB","UNIDAD",0.7]
[159,"767400040083","DISCO DVD - RW DE 4.7 GB","UNIDAD",0.74]
[160,"767400040014","DISCO DVD GRABABLE DE 4.7 GB","UNIDAD",0.68]
[161,"767400040094","DISCO DVD GRABABLE DE 4.7 GB SERIGRAFIADO","UNIDAD",0.68]
[162,"715000110041","ENGRAPADOR CHICO DE OFICINA CON YUNQUE GIRATORIO","UNIDAD",6.49]
[163,"715000110030","ENGRAPADOR DE METAL TIPO ALICATE","UNIDAD",24]
[164,"715000110048","ENGRAPADOR DE METAL TIPO ALICATE PARA GRAPA 26/6","UNIDAD",23.8]
[165,"135000050045","ESCOBA BAJA POLICIA DE 2 PITAS 2 ZUNCHOS","UNIDAD",9]
[166,"135000050060","ESCOBA DE CERDA DE PLÁSTICO 40 cm","UNIDAD",7]
[167,"135000060119","ESCOBILLA DE PLASTICO PARA INODORO CON BASE","UNIDAD",5]
[168,"135000080025","ESCOBILLON DE CERDA PARA PISO X 30 cm","UNIDAD",6.5]
[169,"710600040024","FOLDER MANILA TAMAÑO  A4","EMPAQUE X 25",4.43]
[170,"710600060044","FORRO DE PLASTICO TRANSPARENTE TAMAÑO OFICIO X 5 m","UNIDAD",5]
[171,"172100080006","GASOHOL 84 PLUS","GALON",12.5]
[172,"172100080007","GASOHOL 90 PLUS","GALON",13.5]
[173,"710300060057","GOMA EN BARRA X 40 g APROX.","UNIDAD",2.8]
[174,"718500080010","GRAPA 23/10 X 1000","UNIDAD",2.5]
[175,"718500080026","GRAPA 26/6 X 5000","UNIDAD",2.5]
[176,"135000360009","GUANTE DE JEBE DE USO DOMESTICO TALLA 10","PAR",8]
[177,"135000360022","GUANTE DE JEBE DE USO DOMESTICO TALLA 12","PAR",8]
[178,"135000360003","GUANTE DE JEBE DE USO DOMESTICO TALLA 6","PAR",6]
[179,"135000360007","GUANTE DE JEBE DE USO DOMESTICO TALLA 6 1/2","PAR",6.5]
[180,"135000360004","GUANTE DE JEBE DE USO DOMESTICO TALLA 7","PAR",7]
[181,"135000360008","GUANTE DE JEBE DE USO DOMESTICO TALLA 7 1/2","PAR",7.5]
[182,"135000360005","GUANTE DE JEBE DE USO DOMESTICO TALLA 8","PAR",8]
[183,"135000360006","GUANTE DE JEBE DE USO DOMESTICO TALLA 8 1/2","PAR",8.5]
[184,"135000360002","GUANTE DE JEBE DE USO DOMESTICO TALLA 9","PAR",9]
[185,"135000360001","GUANTE DE JEBE DE USO DOMESTICO TALLA 9 1/2","PAR",9.5]
[186,"135000360015","GUANTE DE JEBE DE USO DOMESTICO TALLA L","PAR",8]
[187,"135000360029","GUANTE DE JEBE DE USO DOMESTICO TALLA L X 10","PAR",8]
[188,"135000360011","GUANTE DE JEBE DE USO SEMI INDUSTRIAL TALLA 6","PAR",8]
[189,"135000360013","GUANTE DE JEBE DE USO SEMI INDUSTRIAL TALLA 7 1/2","PAR",8]
[190,"495700280112","GUANTE PARA EXAMEN DESCARTABLE Nº 7 X 100 UNI","UNIDAD",10]
[191,"139200100117","JABON CARBOLICO EN BARRA X 200 g","UNIDAD",2.6]
[192,"139200100025","JABON DE TOCADOR LIQUIDO X 500 mL","UNIDAD",7.2]
[193,"235200040014","JUEGO DE AJEDREZ","UNIDAD",13]
[194,"133000220009","KRESO X 1 L","UNIDAD",4]
[195,"716000190004","LAPIZ DE CERA CRAYON GRUESO JUEGO X 12","UNIDAD",1.5]
[196,"716000040025","LAPIZ DE COLOR TAMAÑO GRANDE (JUEGO X 12 COLORES)","UNIDAD",5]
[197,"716000040070","LAPIZ GRAFITO Nº 2","UNIDAD",0.2]
[198,"716000040089","LAPIZ NEGRO GRADO  2B","DOCENA",4.1100000000000003]
[199,"716000040112","LAPIZ NEGRO GRADO 2B CON BORRADOR","UNIDAD",0.28999999999999998]
[200,"716000040045","LAPIZ NEGRO Nº 2 CON BORRADOR","UNIDAD",0.34]
[201,"133000240109","LEJIA  (HIPOCLORITO DE SODIO) AL 6%","GALON",8]
[202,"717200140002","LIBRO DE ACTAS DE 100 FOLIOS","UNIDAD",1.85]
[203,"717200140152","LIBRO DE ACTAS EMPASTADO RAYADO TAMAÑO A4 X 100 HOJAS","UNIDAD",9.9]
[204,"717200140150","LIBRO DE ACTAS EMPASTADO RAYADO TAMAÑO A4 X 200 HOJAS","UNIDAD",14.75]
[205,"133000270008","LIMPIA VIDRIO EN SPRAY X 1 L","UNIDAD",10]
[206,"133000270011","LIMPIA VIDRIOS X 650 mL","UNIDAD",8]
[207,"940800130033","LLANTA 195R15","UNIDAD",300]
[208,"940800130247","LLANTA 215/75R17.5","UNIDAD",425]
[209,"940800130250","LLANTA 235/75R15","UNIDAD",515]
[210,"852100010015","MEDALLA DE BRONCE","UNIDAD",11]
[211,"852100010017","MEDALLA DE BRONCE TIPO CIRCULAR","UNIDAD",8.5]
[212,"852100010037","MEDALLA DE ORO","UNIDAD",15]
[213,"852100010002","MEDALLA DE PLATA","UNIDAD",12]
[214,"767500590004","MEMORIA PORTATIL USB DE 8 GB","UNIDAD",22]
[215,"135000180056","MOPA DE ALGODON LIMPIA VIDRIOS DE 100 cm","UNIDAD",10]
[216,"135000180058","MOPA DE ALGODON LIMPIA VIDRIOS DE 25 cm","UNIDAD",8]
[217,"135000180057","MOPA DE ALGODON LIMPIA VIDRIOS DE 60 cm","UNIDAD",8]
[218,"715000440001","MOTA PARA PIZARRA ACRILICA","UNIDAD",1.7]
[219,"239400050007","NET PARA VOLEY","UNIDAD",47]
[220,"710300120139","NOTA AUTOADHESIVA 7.3 cm X 7.3 cm X 500 HOJAS","UNIDAD",7.5]
[221,"503300260025","PABILO N° 20 X 1 kg","UNIDAD",18]
[222,"139200410022","PAÑAL DESCARTABLE TIPO CALZON PARA NIÑO TALLA XXG","UNIDAD",45]
[223,"139200430014","PAÑO HUMEDO HIPOALERGENICO PARA BEBES X 100 HOJAS","UNIDAD",19]
[224,"717200050212","PAPEL BOND  75 g TAMAÑO A4","MILLAR",22.42]
[225,"717200050227","PAPEL BOND 75 g  TAMAÑO A4","EMPAQUE X 500",11.21]
[226,"717200050009","PAPEL BOND 75 g TAMAÑO A3","UNIDAD",0.04]
[227,"717200050353","PAPEL BOND 80 g TAMAÑO A4 DE COLOR","CIENTO",6.26]
[228,"717200050242","PAPEL BOND 80 g TAMAÑO A4 DE COLORES","EMPAQUE X 500",30]
[229,"717200290118","PAPEL COMETA","UNIDAD",0.2]
[230,"717200180040","PAPEL CREPE 50 cm X 1.60 m","UNIDAD",3.5]
[231,"717200180039","PAPEL CREPE 50 cm X 1.60 m COLORES VARIADOS","DECENA",3.5]
[232,"717200180041","PAPEL CREPE 50 cm X 1.80 cm X 10 PLIEGOS","UNIDAD",0.5]
[233,"717200180058","PAPEL CREPE 50 cm X 1.80 m  COLOR AMARILLO","DECENA",3.5]
[234,"717200180054","PAPEL CREPE 50 cm X 1.80 m  COLOR BLANCO","DECENA",3.5]
[235,"717200180061","PAPEL CREPE 50 cm X 1.80 m  COLOR FUCSIA","DECENA",3.5]
[236,"717200180062","PAPEL CREPE 50 cm X 1.80 m  COLOR GUINDA","DECENA",3.5]
[237,"717200180068","PAPEL CREPE 50 cm X 1.80 m  COLOR MORADO","DECENA",3.5]
[238,"717200180057","PAPEL CREPE 50 cm X 1.80 m  COLOR ROJO","DECENA",3.5]
[239,"717200180056","PAPEL CREPE 50 cm X 1.80 m  COLOR VERDE","DECENA",3.5]
[240,"717200180053","PAPEL CREPE 50 cm X 1.80 m COLOR  CELESTE","DECENA",3.5]
[241,"717200180064","PAPEL CREPE 50 cm X 1.80 m COLOR ANARANJADO","DECENA",3.5]
[242,"717200180067","PAPEL CREPE 50 cm X 1.80 m COLOR DORADO","DECENA",3.5]
[243,"717200180065","PAPEL CREPE 50 cm X 1.80 m COLOR LILA","DECENA",3.5]
[244,"717200180060","PAPEL CREPE 50 cm X 1.80 m COLOR MARRON","DECENA",3.5]
[245,"717200180038","PAPEL CREPE 50 cm X 1.80 m COLOR MELÓN","UNIDAD",0.5]
[246,"717200180037","PAPEL CREPE 50 cm X 1.80 m COLOR MORADO","UNIDAD",0.5]
[247,"717200180063","PAPEL CREPE 50 cm X 1.80 m COLOR NEGRO","DECENA",3.5]
[248,"717200180066","PAPEL CREPE 50 cm X 1.80 m COLOR PLATEADO","DECENA",3.5]
[249,"717200180059","PAPEL CREPE 50 cm X 1.80 m COLOR ROSADO","DECENA",3.5]
[250,"717200180020","PAPEL CREPE 50 cm X 2.00 m","UNIDAD",3.5]
[251,"717200180048","PAPEL CREPE 50 cm X 2.00 m  COLOR AMARILLO","DECENA",3.5]
[252,"717200180049","PAPEL CREPE 50 cm X 2.00 m  COLOR AZUL","DECENA",3.5]
[253,"717200180044","PAPEL CREPE 50 cm X 2.00 m  COLOR FUCSIA","DECENA",3.5]
[254,"717200180047","PAPEL CREPE 50 cm X 2.00 m  COLOR ROJO","DECENA",3.5]
[255,"717200180046","PAPEL CREPE 50 cm X 2.00 m  COLOR VERDE","DECENA",3.5]
[256,"717200180045","PAPEL CREPE 50 cm X 2.00 m COLOR ANARANJADO","DECENA",3.5]
[257,"717200180042","PAPEL CREPE 50 cm X 2.00 m COLOR BLANCO","DECENA",3.5]
[258,"717200180043","PAPEL CREPE 50 cm X 2.00 m COLOR CELESTE","DECENA",3.5]
[259,"717200180050","PAPEL CREPE 50 cm X 2.00 m COLOR FUCSIA","UNIDAD",3.5]
[260,"717200180017","PAPEL CREPE DE 1.80 m X 50 cm","UNIDAD",3.5]
[261,"717200180013","PAPEL CREPE DE 1.80 m X 50 cm COLOR AZUL","UNIDAD",3.8]
[262,"717200180019","PAPEL CREPE DE 1.80 m X 50 cm COLOR BLANCO","UNIDAD",3.8]
[263,"717200180018","PAPEL CREPE DE 1.80 m X 50 cm COLOR CELESTE","UNIDAD",3.8]
[264,"717200180012","PAPEL CREPE DE 1.80 m X 50 cm COLOR ROJO","UNIDAD",3.8]
[265,"717200180015","PAPEL CREPE DE 1.80 m X 50 cm COLOR VERDE","UNIDAD",3.8]
[266,"717200180052","PAPEL CREPE METALIZADO 50 cm X 2.00 cm","UNIDAD",0.5]
[267,"717200150015","PAPEL CUADRICULADO 8 OFICIOS","UNIDAD",0.25]
[268,"717200170106","PAPEL LUSTRE 48 cm X 64 cm COLOR ANARANJADO","UNIDAD",0.46]
[269,"717200170110","PAPEL LUSTRE 48 cm X 64 cm COLOR AZUL","UNIDAD",0.46]
[270,"717200170107","PAPEL LUSTRE 48 cm X 64 cm COLOR CELESTE","UNIDAD",0.46]
[271,"717200170109","PAPEL LUSTRE 48 cm X 64 cm COLOR FUCSIA","UNIDAD",0.46]
[272,"717200170111","PAPEL LUSTRE 48 cm X 64 cm COLOR LILA","UNIDAD",0.46]
[273,"717200170133","PAPEL LUSTRE 48 cm X 64 cm COLOR RAL 1028","UNIDAD",0.46]
[274,"717200170131","PAPEL LUSTRE 48 cm X 64 cm COLOR RAL 3005","UNIDAD",0.46]
[275,"717200170130","PAPEL LUSTRE 48 cm X 64 cm COLOR RAL 4012","UNIDAD",0.46]
[276,"717200170132","PAPEL LUSTRE 48 cm X 64 cm COLOR RAL 8002","UNIDAD",0.46]
[277,"717200170108","PAPEL LUSTRE 48 cm X 64 cm COLOR ROSADO","UNIDAD",0.46]
[278,"717200170105","PAPEL LUSTRE 48 cm X 64 cm COLOR VERDE CLARO","UNIDAD",0.46]
[279,"717200170088","PAPEL LUSTRE 50 cm X 70 cm COLOR BLANCO","UNIDAD",0.46]
[280,"717200170089","PAPEL LUSTRE 50 cm X 70 cm COLOR MARRON","UNIDAD",0.46]
[281,"717200170090","PAPEL LUSTRE 50 cm X 70 cm COLOR ROSADO","UNIDAD",0.46]
[282,"717200170097","PAPEL LUSTRE 50 cm X 75 cm DE COLORES","UNIDAD",0.46]
[283,"717200170134","PAPEL LUSTRE 64 cm X 78 cm COLOR AMARILLO","UNIDAD",0.46]
[284,"717200170140","PAPEL LUSTRE 64 cm X 78 cm COLOR AZUL","UNIDAD",0.46]
[285,"717200170136","PAPEL LUSTRE 64 cm X 78 cm COLOR CELESTE","UNIDAD",0.46]
[286,"717200170135","PAPEL LUSTRE 64 cm X 78 cm COLOR NARANJA","UNIDAD",0.46]
[287,"717200170139","PAPEL LUSTRE 64 cm X 78 cm COLOR ROJO","UNIDAD",0.46]
[288,"717200170138","PAPEL LUSTRE 64 cm X 78 cm COLOR ROSADO","UNIDAD",0.46]
[289,"717200170137","PAPEL LUSTRE 64 cm X 78 cm COLOR VERDE","UNIDAD",0.46]
[290,"717200170087","PAPEL LUSTRE 70 cm X 50 cm COLOR ANARANJADO","UNIDAD",0.46]
[291,"717200170092","PAPEL LUSTRE DE 32 cm X 47 cm BLOCK X 30","UNIDAD",0.46]
[292,"717200170104","PAPEL LUSTRE DE 48 cm X 64 cm","UNIDAD",0.46]
[293,"717200170098","PAPEL LUSTRE DE 48 cm X 64 cm COLOR AMARILLO","UNIDAD",0.46]
[294,"717200170099","PAPEL LUSTRE DE 48 cm X 64 cm COLOR NEGRO","UNIDAD",0.46]
[295,"717200170100","PAPEL LUSTRE DE 48 cm X 64 cm COLOR ROJO","UNIDAD",0.46]
[296,"717200170101","PAPEL LUSTRE DE 48 cm X 64 cm COLOR TURQUESA","UNIDAD",0.46]
[297,"717200170102","PAPEL LUSTRE DE 48 cm X 64 cm COLOR VERDE","UNIDAD",0.46]
[298,"717200170103","PAPEL LUSTRE DE 48 cm X 64 cm COLOR VERDE LIMON","UNIDAD",0.46]
[299,"717200170024","PAPEL LUSTRE DE 50 cm X 65 cm","UNIDAD",0.17]
[300,"717200170036","PAPEL LUSTRE DE 50 cm X 65 cm COLOR AMARILLO","UNIDAD",0.17]
[301,"717200170035","PAPEL LUSTRE DE 50 cm X 65 cm COLOR AZUL","UNIDAD",0.17]
[302,"717200170038","PAPEL LUSTRE DE 50 cm X 65 cm COLOR BLANCO","UNIDAD",0.17]
[303,"717200170040","PAPEL LUSTRE DE 50 cm X 65 cm COLOR CELESTE","UNIDAD",0.17]
[304,"717200170096","PAPEL LUSTRE DE 50 cm X 65 cm COLOR LIMON","UNIDAD",0.46]
[305,"717200170042","PAPEL LUSTRE DE 50 cm X 65 cm COLOR NARANJA","UNIDAD",0.17]
[306,"717200170095","PAPEL LUSTRE DE 50 cm X 65 cm COLOR NILO","UNIDAD",0.46]
[307,"717200170034","PAPEL LUSTRE DE 50 cm X 65 cm COLOR ROJO","UNIDAD",0.17]
[308,"717200170037","PAPEL LUSTRE DE 50 cm X 65 cm COLOR VERDE","UNIDAD",0.17]
[309,"717200170094","PAPEL LUSTRE DE 50 cm X 65 cm DE COLORES","UNIDAD",0.46]
[310,"717200170093","PAPEL LUSTRE DE 50 cm X 70 cm DE COLORES","UNIDAD",0.46]
[311,"717200170026","PAPEL LUSTRE DE 60 cm X 50 cm COLOR AMARILLO","UNIDAD",0.46]
[312,"717200170027","PAPEL LUSTRE DE 60 cm X 50 cm COLOR AZUL","UNIDAD",0.46]
[313,"717200170055","PAPEL LUSTRE DE 60 cm X 50 cm COLOR CELESTE","UNIDAD",0.17]
[314,"717200170091","PAPEL LUSTRE DE 60 cm X 50 cm COLOR CORAL","UNIDAD",0.46]
[315,"717200170058","PAPEL LUSTRE DE 60 cm X 50 cm COLOR FUCSIA","UNIDAD",0.17]
[316,"717200170063","PAPEL LUSTRE DE 60 cm X 50 cm COLOR GUINDA","UNIDAD",0.17]
[317,"717200170060","PAPEL LUSTRE DE 60 cm X 50 cm COLOR LILA","UNIDAD",0.17]
[318,"717200170059","PAPEL LUSTRE DE 60 cm X 50 cm COLOR MARRON","UNIDAD",0.17]
[319,"717200170076","PAPEL LUSTRE DE 60 cm X 50 cm COLOR MELON","UNIDAD",0.17]
[320,"717200170062","PAPEL LUSTRE DE 60 cm X 50 cm COLOR MORADO","UNIDAD",0.17]
[321,"717200170057","PAPEL LUSTRE DE 60 cm X 50 cm COLOR NARANJA","UNIDAD",0.17]
[322,"717200170086","PAPEL LUSTRE DE 70 cm X 50 cm COLOR CELESTE","UNIDAD",0.46]
[323,"717200290247","PAPEL MICROCÁPSULA PARA ELABORACION DE RELIEVE TAMAÑO A4","UNIDAD",0.46]
[324,"717200290290","PAPEL PARA MAQUINA TERMOCONFORMADO PARA REPRODUCIR EN BRAILLE 35.2 cm X 47.4 cm","UNIDAD",0.46]
[325,"717200290248","PAPEL PARA MAQUINA TERMOCONFORMADO PARA REPRODUCIR EN BRAILLE TAMAÑO A4","UNIDAD",0.46]
[326,"717200290221","PAPEL SEDA 50 cm X  65 cm","UNIDAD",0.46]
[327,"717200290276","PAPEL SEDA DE 50 cm X 70 cm","UNIDAD",0.46]
[328,"717200290158","PAPEL SEDA DE 55 cm X 40 cm DE COLOR","UNIDAD",0.38]
[329,"717200290135","PAPEL SEDA DE 76.00 cm X 52.50 cm COLOR AMARILLO","UNIDAD",0.38]
[330,"717200290107","PAPEL SEDA DE 76.00 cm X 52.50 cm COLOR BLANCO","UNIDAD",0.38]
[331,"717200290133","PAPEL SEDA DE 76.00 cm X 52.50 cm COLOR FUCSIA","UNIDAD",0.38]
[332,"717200290136","PAPEL SEDA DE 76.00 cm X 52.50 cm COLOR NARANJA","UNIDAD",0.38]
[333,"717200290134","PAPEL SEDA DE 76.00 cm X 52.50 cm COLOR VERDE","UNIDAD",0.38]
[334,"717200260012","PAPELOGRAFO 56 g DE 86 cm X 61 cm","UNIDAD",0.46]
[335,"717200260001","PAPELOGRAFO 60 g DE 86 cm X 61 cm","UNIDAD",0.46]
[336,"717200260045","PAPELOGRAFO 75 g DE 62 cm X 86 cm","UNIDAD",0.46]
[337,"717200260033","PAPELOGRAFO BLANCO 56 g DE 61cm X 86 cm","UNIDAD",0.22]
[338,"717200260046","PAPELOGRAFO BLANCO 75 g DE 61cm X 86 cm","UNIDAD",0.46]
[339,"717200260027","PAPELOGRAFO CUADRICULADO (1 cm APROX.) 56 g DE 86 cm X 61 cm","UNIDAD",0.46]
[340,"717200260028","PAPELOGRAFO CUADRICULADO (2 cm APROX.) 56 g DE 86 cm X 61 cm","UNIDAD",0.46]
[341,"717200260029","PAPELOGRAFO CUADRICULADO (3 cm APROX.) 56 g DE 86 cm X 61 cm","UNIDAD",0.46]
[342,"717200260047","PAPELOGRAFO CUADRICULADO 56 g DE 61 cm X 86 cm","UNIDAD",0.45]
[343,"717200260023","PAPELOGRAFO CUADRICULADO 56 g DE 86 cm X 61 cm","UNIDAD",0.46]
[344,"717200260044","PAPELOGRAFO CUADRICULADO 75 g DE 61 cm X 86 cm","UNIDAD",0.46]
[345,"717200260048","PAPELÓGRAFO RAYADO 56 g 61 cm X 86 cm","UNIDAD",0.46]
[346,"717200260013","PAPELOGRAFO RAYADO 60 g DE 61 cm X 86 cm","UNIDAD",0.46]
[347,"711100040005","PASTA LIMPIA TIPOS X 35 g","UNIDAD",1.65]
[348,"737000050314","PEGAMENTO SILICONA LIQUIDA X 250 mL","UNIDAD",6]
[349,"239400060013","PELOTA DE BASQUETBOL Nº 5","UNIDAD",55]
[350,"239400060015","PELOTA DE FUTBOL Nº 5","UNIDAD",45]
[351,"239400060034","PELOTA DE FUTSAL Nº 3.5","UNIDAD",60]
[352,"239400060067","PELOTA DE GOMA DE VOLEIBOL","UNIDAD",41]
[353,"239400060042","PELOTA DE GOMA PARA BASQUETBOL Nº 07","UNIDAD",55]
[354,"715000120010","PERFORADOR DE 2 ESPIGAS PARA 15 A 20 HOJAS","UNIDAD",8.75]
[355,"715000120022","PERFORADOR DE 2 ESPIGAS PARA 40 HOJAS","UNIDAD",16.760000000000002]
[356,"290500030108","PINCEL DE CERDA BLANCA Nº 16 PLANO","UNIDAD",1.8]
[357,"290500030135","PINCEL DE PELO SINTETICO Nº 10 PLANO","UNIDAD",1.5]
[358,"317500040008","PLASTILINA X 200 g APROX. (JUEGO X 12)","UNIDAD",2.5]
[359,"716000060451","PLUMON MARCADOR DE TINTA AL AGUA PUNTA DELGADA COLOR AZUL","UNIDAD",3.7]
[360,"716000060403","PLUMON MARCADOR DE TINTA AL AGUA PUNTA FINA JUEGO X 12 COLORES","UNIDAD",5]
[361,"716000060415","PLUMON MARCADOR DE TINTA AL AGUA PUNTA GRUESA COLOR AZUL","UNIDAD",2.5]
[362,"716000060413","PLUMON MARCADOR DE TINTA AL AGUA PUNTA GRUESA COLOR NEGRO","UNIDAD",2.5]
[363,"716000060414","PLUMON MARCADOR DE TINTA AL AGUA PUNTA GRUESA COLOR ROJO","UNIDAD",2.5]
[364,"716000060480","PLUMON MARCADOR DE TINTA AL AGUA PUNTA GRUESA JUEGO X 10 COLORES","UNIDAD",10]
[365,"716000060485","PLUMON MARCADOR DE TINTA AL AGUA PUNTA GRUESA JUEGO X 12 COLORES","UNIDAD",12]
[366,"716000060455","PLUMON PARA PIZARRA ACRILICA  PUNTA GRUESA","DOCENA",19.8]
[367,"716000060540","PLUMON PARA PIZARRA ACRILICA PUNTA GRUESA RECARGABLE COLOR AZUL","UNIDAD",3.7]
[368,"716000060542","PLUMON PARA PIZARRA ACRILICA PUNTA GRUESA RECARGABLE COLOR NEGRO","UNIDAD",3.7]
[369,"716000060541","PLUMON PARA PIZARRA ACRILICA PUNTA GRUESA RECARGABLE COLOR ROJO","UNIDAD",3.7]
[370,"716000060389","PLUMON RESALTADOR PUNTA GRUESA BISELADA","UNIDAD",1.4]
[371,"716000060443","PLUMON RESALTADOR PUNTA GRUESA BISELADA COLOR AMARILLO","UNIDAD",2.5]
[372,"716000060445","PLUMON RESALTADOR PUNTA GRUESA BISELADA VERDE","UNIDAD",2.5]
[373,"715000140018","PORTA LAPICERO ACRILICO TIPO CUBO","UNIDAD",2.14]
[374,"716000070021","PORTAMINA DE METAL 0.5 mm","UNIDAD",1.23]
[375,"135000130003","RECOGEDOR DE METAL TAMAÑO GRANDE","UNIDAD",8.5]
[376,"135000130004","RECOGEDOR DE METAL TAMAÑO MEDIANO","UNIDAD",7]
[377,"135000130012","RECOGEDOR DE PLASTICO CON JALADOR","UNIDAD",7]
[378,"135000130020","RECOGEDOR DE PLASTICO DE 30 cm","UNIDAD",7.5]
[379,"135000130018","RECOGEDOR DE PLASTICO DE MANO","UNIDAD",8.5]
[380,"135000130006","RECOGEDOR DE PLASTICO TAMAÑO GRANDE","UNIDAD",11]
[381,"135000130007","RECOGEDOR DE PLASTICO TAMAÑO MEDIANO","UNIDAD",8.5]
[382,"715000190001","REGLA DE PLASTICO 30 cm","UNIDAD",0.53]
[383,"133000540005","REMOVEDOR DE SARRO X 1 L","UNIDAD",3.2]
[384,"710600100234","SOBRE MANILA TAMAÑO  A4","EMPAQUE X 50",8.67]
[385,"718500100017","SUJETADOR PARA PAPEL (TIPO FASTENER) DE METAL","EMPAQUE X 50",3.5]
[386,"718500100010","SUJETADOR PARA PAPEL (TIPO FASTENER) DE METAL X 100","UNIDAD",4.47]
[387,"718500100014","SUJETADOR PARA PAPEL (TIPO FASTENER) DE METAL X 50","UNIDAD",4.47]
[388,"646100030014","TACHO DE PLÁSTICO 10 L APROX.","UNIDAD",18]
[389,"646100030027","TACHO DE PLÁSTICO TIPO SANSON 100 L APROX.","UNIDAD",59.8]
[390,"646100030240","TACHO DE POLIETILENO PARA RECICLAJE DE BASURA 16 L APROX.","UNIDAD",18.5]
[391,"715000220020","TAJADOR DE METAL CHICO","UNIDAD",0.55000000000000004]
[392,"716000090064","TAMPON CON CUBIERTA DE PLASTICO 12.5 cm X 9.5 cm APROX. COLOR AZUL","UNIDAD",2.6]
[393,"716000090066","TAMPON CON CUBIERTA DE PLASTICO 12.5 cm X 9.5 cm APROX. COLOR NEGRO","UNIDAD",2.6]
[394,"895700080034","TELA FRANELA X 70 cm DE ANCHO","METRO",5.5]
[395,"291000100057","TEMPERA CON APLICADOR X 250 mL COLOR AMARILLO","UNIDAD",4.9000000000000004]
[396,"291000100055","TEMPERA CON APLICADOR X 250 mL COLOR AZUL","UNIDAD",4.9000000000000004]
[397,"291000100056","TEMPERA CON APLICADOR X 250 mL COLOR BLANCO","UNIDAD",4.9000000000000004]
[398,"291000100058","TEMPERA CON APLICADOR X 250 mL COLOR NEGRO","UNIDAD",4.9000000000000004]
[399,"291000100054","TEMPERA CON APLICADOR X 250 mL COLOR ROJO","UNIDAD",4.9000000000000004]
[400,"291000100061","TEMPERA CON APLICADOR X 250 mL COLOR VERDE","UNIDAD",4.9000000000000004]
[401,"291000100059","TEMPERA X 250 mL","UNIDAD",3.9]
[402,"715000230050","TIJERA DE METAL DE 5 in CON PUNTA ROMA Y MANGO DE PLASTICO","UNIDAD",1.95]
[403,"715000230076","TIJERA DE METAL DE 5 in PARA ZURDO CON PUNTA ROMA Y MANGO DE PLÁSTICO","UNIDAD",1.87]
[404,"715000230041","TIJERA DE METAL DE 7 in CON MANGO DE PLASTICO","UNIDAD",3.5]
[405,"716000170009","TINTA PARA MAQUINA NUMERADORA X 30 mL APROX. COLOR NEGRO","UNIDAD",7]
[406,"716000260013","TINTA PARA PLUMON DE PIZARRA ACRILICA X 27.5 mL COLOR AZUL","UNIDAD",2.2999999999999998]
[407,"716000260015","TINTA PARA PLUMON DE PIZARRA ACRILICA X 27.5 mL COLOR NEGRO","UNIDAD",2.2999999999999998]
[408,"716000260014","TINTA PARA PLUMON DE PIZARRA ACRILICA X 27.5 mL COLOR ROJO","UNIDAD",2.2999999999999998]
[409,"716000160013","TINTA PARA TAMPON X 30 mL APROX. COLOR AZUL","UNIDAD",1.2]
[410,"716000160014","TINTA PARA TAMPON X 30 mL APROX. COLOR NEGRO","UNIDAD",1.2]
[411,"767400061981","TÓNER DE IMPRESIÓN PARA BROTHER COD. REF. TN 750 NEGRO","UNIDAD",399]
[412,"767400060748","TONER DE IMPRESION PARA HP COD. REF. 05X CE505X NEGRO","UNIDAD",198]
[413,"767400060354","TONER DE IMPRESION PARA HP COD. REF. 12A Q2612A NEGRO","UNIDAD",298]
[414,"767400060064","TÓNER DE IMPRESIÓN PARA HP COD. REF. 13A Q2613A NEGRO","UNIDAD",215]
[415,"767400060481","TÓNER DE IMPRESIÓN PARA HP COD. REF. 15A C7115A NEGRO","UNIDAD",111]
[416,"767400060630","TONER DE IMPRESION PARA HP COD. REF. 36A CB436A NEGRO","UNIDAD",175]
[417,"767400060168","TONER DE IMPRESION PARA HP COD. REF. 49A Q5949A NEGRO","UNIDAD",310]
[418,"767400062073","TONER DE IMPRESION PARA HP COD. REF. 83A CF283A NEGRO","UNIDAD",215]
[419,"767400061035","TONER DE IMPRESION PARA HP COD. REF. 85A CE285A NEGRO","UNIDAD",218]
[420,"767400061410","TONER DE IMPRESION PARA HP COD. REF. CE280A NEGRO","UNIDAD",250]
[421,"767400060721","TONER DE IMPRESION PARA HP COD. REF. CE505A NEGRO","UNIDAD",230]
[422,"767400060899","TÓNER DE IMPRESIÓN PARA KONICA MINOLTA COD. REF. TN 511 024B NEGRO","UNIDAD",236]
[423,"767400061177","TONER DE IMPRESION PARA KONICA MINOLTA COD. REF. TN 710 02XF NEGRO","UNIDAD",380]
[424,"767400061998","TONER DE IMPRESION PARA KYOCERA COD. REF. TK 1122 NEGRO","UNIDAD",195]
[425,"767400061508","TÓNER DE IMPRESIÓN PARA KYOCERA COD. REF. TK 1147 NEGRO","UNIDAD",325]
[426,"767400060659","TONER DE IMPRESION PARA KYOCERA COD. REF. TK 132 1T02HS0US0 NEGRO","UNIDAD",270]
[427,"767400062063","TÓNER DE IMPRESIÓN PARA KYOCERA COD. REF. TK 3102 NEGRO","UNIDAD",350]
[428,"767400062030","TÓNER DE IMPRESIÓN PARA KYOCERA COD. REF. TK 3122 NEGRO","UNIDAD",288]
[429,"767400060517","TONER DE IMPRESION PARA KYOCERA COD. REF. TK 657 1T02FB0US NEGRO","UNIDAD",195]
[430,"767400061093","TONER DE IMPRESION PARA KYOCERA COD. REF. TK-162 NEGRO","UNIDAD",270]
[431,"767400061012","TONER DE IMPRESION PARA KYOCERA COD. REF. TK-172 NEGRO","UNIDAD",215]
[432,"767400061096","TÓNER DE IMPRESIÓN PARA KYOCERA COD. REF. TK477 NEGRO","UNIDAD",288]
[433,"767400061376","TONER DE IMPRESION PARA KYOCERA COD. REF. TK-6307K NEGRO","UNIDAD",492]
[434,"767400060649","TÓNER DE IMPRESIÓN PARA LEXMARK COD. REF. 08A0478 NEGRO","UNIDAD",199]
[435,"767400062218","TÓNER DE IMPRESIÓN PARA XEROX COD. REF. 006R01606 NEGRO","UNIDAD",460]
[436,"135000180103","TRAPEADOR COMPLETO DE MOPA MANGO DE MADERA 29 cm X 1.29 m","UNIDAD",12]
[437,"135000180080","TRAPEADOR COMPLETO DE MOPA MANGO DE MADERA 30 cm X 1.55 m","UNIDAD",12]
[438,"135000180090","TRAPEADOR COMPLETO DE MOPA MANGO DE MADERA 32 cm X 1.30 m","UNIDAD",12]
[439,"135000180046","TRAPEADOR DE HILO CON MANGO DE MADERA","UNIDAD",15]
[440,"135000180073","TRAPEADOR DE YUTE 40 cm X 60 cm","UNIDAD",10]
[441,"135000180089","TRAPEADOR DE YUTE 50 cm X 80 cm","UNIDAD",10]
[442,"135000180092","TRAPEADOR DE YUTE 60 cm X 60 cm","UNIDAD",10]
[443,"135000180096","TRAPEADOR MICROFIBRA 40 cm X 60 cm","UNIDAD",12]
[444,"135000180054","TRAPEADOR MOPA DE ALGODON DE 30 cm","UNIDAD",12]
[445,"135000180041","TRAPEADOR MOPA DE PABILO DE 30 cm","UNIDAD",12]
[446,"135000180042","TRAPEADOR MOPA DE PABILO DE 50 cm","UNIDAD",16]
[447,"135000180067","TRAPEADOR MOPA DE PABILO DE 80 cm","UNIDAD",8]
[]
[]
[]
[]
[]
[]
[333,"021700030005","SERVICIO DE DECORACION DE CARRO ALEGORICO","SERVICIO"]
[334,"040100010004","SERVICIO DE ALMUERZO POR REUNION DE TRABAJO","SERVICIO"]
[335,"040100010005","SERVICIO DE ATENCION DE REFRIGERIOS","SERVICIO"]
[336,"040100010026","SERVICIO DE PREPARACION DE ALMUERZO","SERVICIO"]
[337,"040100010030","SERVICIO DE ALMUERZO","SERVICIO"]
[338,"071100380346","SERVICIO DE JURADO DE ENVENTOS DE JUEGOS FLORALES","SERVICIO"]
[339,"071100380726","SERVICIO DE ELABORACION DEL CUADRO DE NECESIDADES","SERVICIO"]
[340,"071100382886","SERVICIO DE APOYO EN TALLERES DE CAPACITACION","SERVICIO"]
[341,"071100385650","SERVICIO DE JURADO CALIFICADOR PARA EVENTOS EDUCATIVOS","SERVICIO"]
[342,"100100040020","SERVICIO DE APOYO EN ORGANIZACIÓN DE EVENTOS","SERVICIO"]
[343,"150100040006","SERVICIO DE ELABORACION DE CONTENIDO PUBLICITARIO","SERVICIO"]
[344,"150500010004","SERVICIO DE DIFUSION DE SPOTS RADIALES","SERVICIO"]
[345,"150500020004","SERVICIOS TELEVISIVOS - PROGRAMAS OFICIALES","SERVICIO"]
[346,"170100030758","SERVICIO DE ASISTENCIA TECNICA EN TEMAS DE SIAF","SERVICIO"]
[347,"210100010080","SERVICIO DE APOYO ADMINISTRATIVO","SERVICIO"]
[348,"210100010187","SERVICIO DE APOYO LOGISTICO","SERVICIO"]
[349,"210100040118","SERVICIO DE PROCESAMIENTO Y ACTUALIZACIÓN DE DATOS","SERVICIO"]
[350,"250500040009","SERVICIO DE ARBITRAJE DE FUTBOL","SERVICIO"]
[351,"250500040010","SERVICIO DE ARBITRAJE DE DEPORTES","SERVICIO"]
[352,"250500040061","SERVICIO DE DISEÑO DE SONIDO","SERVICIO"]
[353,"500100050561","SERVICIO DE IMPRESIONES EN GENERAL","SERVICIO"]
[354,"500100051352","GRABACION DE MEDALLA","SERVICIO"]
[355,"501500030095","SERVICIO DE DISEÑO Y DIAGRAMACION DE CUADERNILLOS PARA EVALUACION A DOCENTES","SERVICIO"]
[356,"502000030005","SERVICIO DE EMPASTADO","SERVICIO"]
[357,"526000130112","INSTALACION DE CARPAS (NO INCLUYE EL BIEN)","SERVICIO"]
[358,"526000130159","SERVICIO DE INSTALACION ELECTRICA","SERVICIO"]
[359,"526000130275","INSTALACION DE LAMINADO PARA VENTANA","SERVICIO"]
[360,"600100060006","SERVICIO DE MANTENIMIENTO DE INFRAESTRUCTURAS EN GENERAL","SERVICIO"]
[361,"602000010100","MANTENIMIENTO CORRECTIVO DE IMPRESORA","SERVICIO"]
[362,"607500070105","MANTENIMIENTO CORRECTIVO DE MOTOR DE VEHICULO","SERVICIO"]
[363,"607500070148","MANTENIMIENTO PREVENTIVO DE VEHICULOS EN GENERAL","SERVICIO"]
[364,"607500070149","MANTENIMIENTO CORRECTIVO DE VEHICULOS EN GENERAL","SERVICIO"]
[365,"607500070196","MANTENIMIENTO PREDICTIVO DE VEHICULOS","SERVICIO"]
[366,"701000030001","SERVICIO DE GIGANTOGRAFIA","SERVICIO"]
[367,"701000040002","SERVICIO DE FOTOCOPIADO","SERVICIO"]
[368,"701000040003","SERVICIO DE FOTOCOPIADO Y ANILLADO","SERVICIO"]
[369,"701000040026","SERVICIO DE FOTOCOPIADO E IMPRESIONES","SERVICIO"]
[370,"850500050009","SEGURO OBLIGATORIO DE ACCIDENTES DE TRANSITO - SOAT (RENOVACION)","SERVICIO"]
[371,"850500050011","SEGURO OBLIGATORIO DE ACCIDENTES DE TRANSITO - SOAT (RENOVACION) PARA CAMION","SERVICIO"]
[372,"870100010001","SERVICIO DE AGUA POTABLE","SERVICIO"]
[373,"870100010002","SERVICIO DE AGUA POTABLE Y ALCANTARILLADO","SERVICIO"]
[374,"870100020003","SERVICIO DE ENERGIA ELECTRICA","SERVICIO"]
[375,"870100030010","SERVICIO DE TELEFONIA FIJA","SERVICIO"]
[376,"870500010001","SERVICIO DE TELEFONIA MOVILES (CELULAR)","SERVICIO"]
[377,"870500030035","SERVICIO DE CONEXION DE INTERNET","SERVICIO"]
[378,"870500030038","SERVICIO DE DOMINIO Y HOSTING PARA LA PAGINA WEB","SERVICIO"]
[379,"870500030053","SERVICIO DE INTERNET INALAMBRICO PORTATIL","SERVICIO"]
[380,"901000010012","TRASLADO PERSONAL COMISION DE SERVICIO - PASAJES AEREOS","SERVICIO"]
[381,"901000060019","TRANSPORTE Y TRASLADO DE PERSONAL","SERVICIO"]
[382,"901500070043","SERVICIO DE TRANSPORTE Y DISTRIBUCIÓN DE MATERIALES EDUCATIVOS","SERVICIO"]
[383,"940100040038","ALQUILER DE EQUIPO DE SONIDO","SERVICIO"]
[384,"940500040001","ALQUILER DE ALMACEN","SERVICIO"]
[385,"940500040027","ALQUILER DE LOCAL","SERVICIO"]
[386,"941000020004","ALQUILER DE CARPA","SERVICIO"]
[387,"040100010001","SERVICIO DE ALIMENTACION DE PERSONAS","SERVICIO"]
[388,"040100010015","SERVICIO DE ALIMENTACION PARA EVENTOS VARIOS","SERVICIO"]
[389,"040100010017","SERVICIO DE PREPARACION DE REFRIGERIOS","SERVICIO"]
[390,"070100162833","CONSULTORIA EN EJECUCION DE TALLERES DE CAPACITACION","SERVICIO"]
[391,"071100380136","SERVICIO ESPECIALIZADO EN OPERATIVIDAD Y MANEJO DE EQUIPOS","SERVICIO"]
[392,"071100380150","APOYO LOGISTICO PARA EJECUCION DE EVENTOS","SERVICIO"]
[393,"071100380322","SERVICIO TECNICO EN SONIDO","SERVICIO"]
[394,"071100380694","SERVICIO DE CONFIGURACION DE FIREWALL EN EQUIPO INFORMATICO","SERVICIO"]
[395,"071100380737","SERVICIO DE FACILITACION EN TALLERES DE CAPACITACION","SERVICIO"]
[396,"071100381571","SERVICIO DE ELABORACION DE CONTENIDOS DE PUBLICACIONES IMPRESAS Y DIGITALES","SERVICIO"]
[397,"071100382452","SERVICIO DE APOYO TECNICO EN MANTENIMIENTO","SERVICIO"]
[398,"071100384227","SERVICIO DE DEGUSTACION Y  PREPARACION DE BEBIDAS Y ALIMENTOS","SERVICIO"]
[399,"100100010005","FACILITADOR PARA TALLER DE CAPACITACION","SERVICIO"]
[400,"100100010008","SERVICIO DE ATENCION PARA EVENTOS DIVERSOS","SERVICIO"]
[401,"110500040019","SERVICIO DE MAESTRO DE OBRA","SERVICIO"]
[402,"150100040002","SERVICIO DE PUBLICIDAD- IMAGEN INSTITUCIONAL","SERVICIO"]
[403,"150500010009","SERVICIO DE PRODUCCION Y DIFUSION DE SPOT RADIAL","SERVICIO"]
[404,"170100010004","SERVICIO DE PROCESAMIENTO DE DATOS","SERVICIO"]
[405,"170100030064","CONTRATACION DEL SERVICIO DE ELABORACION DE PAGINA WEB","SERVICIO"]
[406,"170100030170","SERVICIO DE SOPORTE TECNICO DE EQUIPOS DE COMPUTO","SERVICIO"]
[407,"170100030364","SERVICIO DE ANALISIS Y PROGRAMACION DE SISTEMAS INFORMATICOS","SERVICIO"]
[408,"170100030549","SERVICIO DE CONFIGURACION Y DESPLIEGUE DE APLICACIONES EN SERVIDOR WEB","SERVICIO"]
[409,"210100010139","SERVICIO DE APOYO OPERATIVO","SERVICIO"]
[410,"210100010410","SERVICIO DE ASISTENTE ADMINISTRATIVO","SERVICIO"]
[411,"210100010484","SERVICIO SECRETARIAL","SERVICIO"]
[412,"210100010556","SERVICIO DE APOYO ADMINISTRATIVO EN TEMAS DE LOGISTICA","SERVICIO"]
[413,"260200010021","SERVICIO DE CONFECCION DE VESTUARIO","SERVICIO"]
[414,"502000050002","SERVICIO DE EMPASTE Y ENCUADERNACION","SERVICIO"]
[415,"520100010002","INSTALACION DE ALFOMBRAS EN GENERAL","SERVICIO"]
[416,"526000130027","INSTALACION DE VIDRIOS","SERVICIO"]
[417,"526000130056","INSTALACION DE CORTINAS","SERVICIO"]
[418,"526000130130","SERVICIO DE INSTALACION DE PISOS LAMINADOS","SERVICIO"]
[419,"526000150033","SERVICIO DE IMPLEMENTACIÓN INTEGRAL DE CABLEADO ESTRUCTURADO DE RED DE DATOS","SERVICIO"]
[420,"603500010027","MANTENIMIENTO CORRECTIVO DE FOTOCOPIADORA","SERVICIO"]
[421,"607500070069","SERVICIO DE TAPIZADO DE VEHICULO","SERVICIO"]
[422,"607500070077","SERVICIO DE CAMBIO DE ACEITE","SERVICIO"]
[423,"607500070161","SERVICIO DE LAVADO DE VEHICULOS","SERVICIO"]
[424,"701000020094","SERVICIO DE PRODUCCIÓN Y CONDUCCIÓN DE PROGRAMAS RADIALES","SERVICIO"]
[425,"850500050010","SEGURO OBLIGATORIO DE ACCIDENTES DE TRANSITO - SOAT (RENOVACION) PARA AUTOMOVIL","SERVICIO"]
[426,"850500050021","SEGURO OBLIGATORIO DE ACCIDENTES DE TRANSITO - SOAT (PRIMA) PARA OMNIBUS","SERVICIO"]
[427,"900100020008","SERVICIO DE CORREO POSTAL","SERVICIO"]
[428,"901000010004","TRASLADO PERSONAL - COMISION DE SERVICIO - PASAJES AEREOS NACIONAL","SERVICIO"]
[429,"901500070008","SERVICIO DE TRANSPORTE TERRESTRE","SERVICIO"]
[430,"940500040023","ALQUILER DE LOCAL PARA USO COMO ALMACEN","SERVICIO"]
[431,"022000010019","ACONDICIONAMIENTO Y REMODELACION DE INSTALACIONES EN GENERAL","SERVICIO"]
[432,"070100160025","CONSULTORIA ASISTENCIA TECNICA","SERVICIO"]
[433,"070100162534","CONSULTORÍA PARA RECOPILACIÓN Y ANÁLISIS DE INFORMACIÓN","SERVICIO"]
[434,"070100163392","ASESORIAS Y CONSULTORIAS EN OTRAS ESPECIALIDADES","SERVICIO"]
[435,"071100380179","SERVICIO DE EJECUCION DE EVENTOS","SERVICIO"]
[436,"071100382097","SERVICIO EN COMUNICACIÓN E IMAGEN INSTITUCIONAL","SERVICIO"]
[437,"071100383715","SERVICIO DE REVISION Y VERIFICACION DE DOCUMENTACION REFERENTE A CONTRATACIONES EN DIVERSOS TEMAS","SERVICIO"]
[438,"071100384204","SERVICIO DE ASISTENCIA TECNICA EN LA DIFUSION DE EVENTOS INSTITUCIONALES Y EN EL DISEÑO DE IMPLEMENTACION DE ESTRATEGIA DE COMUNICACIÓN","SERVICIO"]
[439,"071100384640","SERVICIO DE ASISTENCIA TECNICA EN GESTION Y DIFUSION DE PRENSA EN MEDIOS DE COMUNICACIÓN","SERVICIO"]
[440,"100500020007","SERVICIO DE ANIMACION DE EVENTOS","SERVICIO"]
[441,"150500010012","SERVICIO DE ESPACIO RADIAL EN EMISORA DE ALCANCE LOCAL","SERVICIO"]
[442,"170100010012","SERVICIO DE PROCESAMIENTO DE INFORMACION","SERVICIO"]
[443,"170100010017","SERVICIO DE ANALISIS DE INFORMACION Y PROCESAMIENTO DE DATOS","SERVICIO"]
[444,"210100010007","TOMA DE INVENTARIO FISICO DE BIENES PATRIMONIALES","SERVICIO"]
[445,"250500030016","SERVICIO DE ORQUESTA MUSICAL","SERVICIO"]
[446,"251500010003","BAÑOS TURCOS, DE VAPOR O RITUALES","SERVICIO"]
[447,"521500030012","INSTALACION DE SISTEMA CONTINUO DE IMPRESION","SERVICIO"]
[448,"526000130395","SERVICIO INSTALACION DE AULAS PREFABRICADAS (NO INCLUYE EL BIEN)","SERVICIO"]
[449,"602000010105","MANTENIMIENTO CORRECTIVO DE EQUIPO DE COMPUTO","SERVICIO"]
[450,"602000010116","MANTENIMIENTO CORRECTIVO DE IMPRESORA LASER","SERVICIO"]
[451,"607500070066","SERVICIO DE LAVADO Y ENGRASE DE VEHICULOS","SERVICIO"]
[452,"701000020067","SERVICIO DE REPRODUCCION DE DVD","SERVICIO"]
[453,"701000020097","SERVICIO DE ASISTENCIA DE PRODUCCION DE PROGRAMAS CULTURALES RADIALES","SERVICIO"]
[454,"701000040031","SERVICIO DE FOTOCOPIADO, IMPRESION Y ESCANEO EN EQUIPO MULTIFUNCIONAL","SERVICIO"]
[455,"901000050001","TRASLADO PERSONAL MOVILIDAD LOCAL -SERVICIO URBANO","SERVICIO"]
[456,"901000060017","SERVICIO DE MOVILIDAD","SERVICIO"]
[457,"940100090002","ALQUILER DE EQUIPO TOPOGRAFICO","SERVICIO"]
[458,"940100090004","ALQUILER DE ESTACION TOTAL COMPUTARIZADA","SERVICIO"]

{"sheet":"CENTRO_COSTO","index":4,"n_rows":83,"n_cols":10,"rows_kept":83,"cut":false,"hidden":true,"merged":[]}
["N°","Distrito","Cód. Mod.","Nombre de IE","RESPONSABLE","TECHO-PPTO","Tipo IE","Total  de estudiantes matriculados (*)",null,"area"]
[null,"Mañazo","311-1434","GOBIERNO REGIONAL DE PUNO - UGEL PUNO","CORNEJOMAMANIDAVID GREGORIO",null,null,null,{"$f":"+B2","v":"Mañazo"}]
[null,"Puno","1434.01","DIRECCIÓN GENRAL UGEL PUNO","CORNEJOMAMANIDAVID GREGORIO",null,null,null,"Puno"]
[1,"Puno","1434.01.01","DIRECCION GENERAL","CORNEJOMAMANIDAVID GREGORIO",null,null,null,"Puno"]
[2,"Puno","1434.01.02","SECRETARIA DIRECCIÓN","FLORESCANOYUSEY DEL PILAR YASMIN",null,null,null,"Puno"]
[3,"Puno","1434.01.03","TRAMITE DOCUMENTARIO","FORAQUITAGUZMANJUANA SONIA ROXANA",null,null,null,"Puno"]
[4,"Puno","1434.01.04","IMAGEN INSTITUCIONAL","GORDILLOHERMOSACARLOS",null,null,null,"Puno"]
[5,"Puno","1434.01.05","ACTAS Y CERTIFICADOS","TURPOVILCASIMON",null,null,null,"Puno"]
[6,"Puno","1434.01.06","SECRETARIO TECNICO COPROA","TACCAPUMACAJIAEFRAIN",null,null,null,"Puno"]
[null,"Puno","1434.02","ÁREA DE ASESORIA JURIDICA","CRUZMAMANIFLAVIO",null,null,null,"Puno"]
[7,"Puno","1434.02.01","JEFE DE ASESORIA JURIDICA","CRUZMAMANIFLAVIO",null,null,null,"Puno"]
[8,"Puno","1434.02.02","SECRETARIA OAJ","DUEÑASZEAGERMAN",null,null,null,"Puno"]
[9,"Puno","1434.02.03","ABOGADO I","BAILONARIALFREDO",null,null,null,"Puno"]
[null,"Puno","1434.03","ORGANO DE CONTROL INSTITUCIONAL","GALLEGOSVARGASOSWALDO COSME",null,null,null,"Puno"]
[10,"Puno","1434.03.01","ORGANO DE CONTROL INSTITUCIONAL","GALLEGOSVARGASOSWALDO COSME",null,null,null,"Puno"]
[11,"Puno","1434.03.02","SECRETARIA II - OCI","CHAVEZMOLINAMARIA LIVIA",null,null,null,"Puno"]
[12,"Puno","1434.03.03","AUDITOR","AROAPAZAQUISPERUBY ALBERTO",null,null,null,"Puno"]
[null,"Puno","1434.04","ÄREA DE GESTION ADMINISTRATIVA","PANIURAQUISPEMARIA ROSA",null,null,null,"Puno"]
[13,"Puno","1434.04.01","JEFE DE AGA","PANIURAQUISPEMARIA ROSA",null,null,null,"Puno"]
[14,"Puno","1434.04.02","SECRETARIA ADMINISTRACION","PACOMPIAPAUCARFLORA",null,null,null,"Puno"]
[15,"Puno","1434.04.03","OFICINA DE ABASTECIMIENTOS","QUISPEFRISANCHOELAR PABLO",null,null,null,"Puno"]
[16,"Puno","1434.04.04","OFICINA DE CONTABILIDAD","APAZAROJASJAVIER",null,null,null,"Puno"]
[17,"Puno","1434.04.05","TESORERIA","GUERRAMARTINEZLIZARDO FULGENCIO",null,null,null,"Puno"]
[18,"Puno","1434.04.06","ESPECIALISTA EN PERSONAL","ZAPANAPINEDATEODINA ELENA",null,null,null,"Puno"]
[19,"Puno","1434.04.07","SECRETARIA OFICNA DE PERSONAL","MATAMETMELOMARY VICENTA",null,null,null,"Puno"]
[20,"Puno","1434.04.08","SERVICIO DE TRANSPORTES I","FLORESCONDORIJESUS MARCIAL",null,null,null,"Puno"]
[21,"Puno","1434.04.09","SERVICIO DE LIMPIEZA","MAQUERAFLORESMARCELINO",null,null,null,"Puno"]
[22,"Puno","1434.04.10","ALMACEN","MAMANILUQUEMARWIN",null,null,null,"Puno"]
[23,"Puno","1434.04.11","PATRIMONIO","JAMACHIARPASINORMA SOLEDAD",null,null,null,"Puno"]
[24,"Puno","1434.04.12","CAJA","MAQUERAFLORESMARCELINO",null,null,null,"Puno"]
[25,"Puno","1434.04.13","IMPRESIONES","CUTIPAHUARCAYACLAUDIO",null,null,null,"Puno"]
[26,"Puno","1434.04.14","ESPECIALISTA EN INFORMATICA","CCOPALAUREANOPATRICIA",null,null,null,"Puno"]
[27,"Puno","1434.04.15","PROYECTO RESOLUCIONES","VILCAMORALESCONCEPCION",null,null,null,"Puno"]
[28,"Puno","1434.04.16","OPERADOR PAD","RAMOSQUISPEMERY ROXANA",null,null,null,{"$f":"+B34","v":"Puno"}]
[29,"Puno","1434.04.17","BIENESTAR SOCIAL","TAPIAHUACASIAZALIA",null,null,null,"Puno"]
[30,"Puno","1434.04.18","ESCALAFON","CORACAHUANAHERMILIO",null,null,null,"Puno"]
[31,"Puno","1434.04.19","ESPECIALISTA EN ESCALAFON","CORACAHUANAHERMILIO",null,null,null,"Puno"]
[32,"Puno","1434.04.20","REMUNERACIONES","GOMEZACHOCALLACELIA",null,null,null,"Puno"]
[33,"Puno","1434.04.21","ESPECIALISTA EN REMUNERACIONES","CAHUANATICONAWALTER DUVERLIH",null,null,null,"Puno"]
[34,"Puno","1434.04.22","ESPECIALISTA EN ALMACEN","QUISPEFRISANCHOELAR PABLO",null,null,null,"Puno"]
[35,"Puno","1434.04.23","TECNICO EN ABASTECIMIENTO","CONZAPADILLOLUIS FERNANDO",null,null,null,"Puno"]
[36,"Puno","1434.04.24","TECNICO EN ESCALAFON","CCOPALAUREANOPATRICIA",null,null,null,"Puno"]
[37,"Puno","1434.04.25","SERVICIO DE TRANSPORTE","AYALAMURGAJUAN",null,null,null,"Puno"]
[38,"Puno","1434.04.26","SERVICIO DE TRANSPORTES II","HUARCAYACOACCALLALENIN",null,null,null,"Puno"]
[39,"Puno","1434.04.27","SERVICIO DE TRANSPORTES III","VELASQUEZCOILAJUAN PASTOR",null,null,null,"Puno"]
[null,"Puno","1434.05","ÄREA DE GESTION PEDAGÓGICA","CHOQUECOPARIRENE",null,null,null,"Puno"]
[40,"Puno","1434.05.01","JEFE DE AGP","CHOQUECOPARIRENE",null,null,null,"Puno"]
[41,"Puno","1434.05.02","SECRETARIA AGP","PALOMAMAYTAVILMA",null,null,null,"Puno"]
[42,"Puno","1434.05.03","ESPECIALISTA EN EDUCACION INICIAL","GUEVARAPINEDARUTH YENY",null,null,null,"Puno"]
[43,"Puno","1434.05.04","ESPECIALISTA EN EDUCACION PRIMARIA - I","HUARACHAORTEGAMARICELA JOVANA",null,null,null,"Puno"]
[44,"Puno","1434.05.05","ESPECIALISTA EN MATEMATICA","RAMOSALIAGANOEMI YESENIA",null,null,null,"Puno"]
[45,"Puno","1434.05.06","ESPECIALISTA EN COMUNICACION","MELOQUISPERICARDO",null,null,null,"Puno"]
[46,"Puno","1434.05.07","ESPECIALISTA EN CTA","QUESADAVELEZPERCY",null,null,null,"Puno"]
[47,"Puno","1434.05.08","ESPECIALISTA EN CC.SS","CHALCOUGARTEMAXIMILIANO",null,null,null,"Puno"]
[48,"Puno","1434.05.09","ESPECIALISTA EN EDUCACION FISICA","MANSILLAPARIMARCO ADRIAN",null,null,null,"Puno"]
[49,"Puno","1434.05.10","ESPECIALISTA EN TOE","NUÑEZAROAPAZADAYME ADALID",null,null,null,"Puno"]
[50,"Puno","1434.05.11","ESPECIALISTA EN CETPRO","HUANCAMENDOZAJESUS FORTUNATO",null,null,null,"Puno"]
[51,"Puno","1434.05.12","ESPECIALISTA EN EDUCACION EIB- RURAL","FLORESCAHUANAYANED",null,null,null,"Puno"]
[52,"Puno","1434.05.13","ASISTENTE DE SERVICIO EDUCACION Y CULTURA","COAQUIRAAPAZAMIRIAM VERONICA",null,null,null,"Puno"]
[53,"Puno","1434.05.14","GESTOR LOCAL PELA","ORTEGAGUZMANMILAGROS JANET",null,null,null,"Puno"]
[54,"Puno","1434.05.15","ESPECIALISTA EN TIC","VASQUEZCANSAYALUIS CESAR",null,null,null,"Puno"]
[55,"Puno","1434.05.16","COORDINADOR LOCAL DE PREVAED","ZEAHUARAYACARLOS",null,null,null,"Puno"]
[56,"Puno","1434.05.17","ESPECIALISTA EN FORMACIÓN CIUDADANA Y CIVICA","LAQUILAIMEEDWIN",null,null,null,"Puno"]
[57,"Puno","1434.05.18","ESPECIALISTA EN ALFABETIZACION","NUÑEZAROAPAZADAYME ADALID",null,null,null,"Puno"]
[58,"Puno","1434.05.19","ESPECIALISTA EN CEBA","LARICOCHALLCHAANTONIO SANTIAGO",null,null,null,"Puno"]
[59,"Puno","1434.05.20","ESPECIALISTA INGLES","PONCEFUENTESYOVANA FLORINDA",null,null,null,{"$f":"+B66","v":"Puno"}]
[60,"Puno","1434.05.21","ESPECIALISTA EPT","CCORITIPOGERMAN",null,null,null,"Puno"]
[61,"Puno","1434.05.22","ESPECIALISTA EN PRONOEI","GONZALOVILCAPAZABEATRIZ",null,null,null,"Puno"]
[62,"Puno","1434.05.23","RESPONSABLE L. C. INFORMACIÓN - PELA","FLORESQUISPEJOSE LOLO",null,null,null,"Puno"]
[63,"Puno","1434.05.24","ESPECIALISTA EN EDUCACION PRIMARIA - II","VELASQUEZPEDRAZACORINA VILMA",null,null,null,"Puno"]
[64,"Puno","1434.05.25","ESPECIALISTA EN CONVIVENCIA ESCOLAR","MACEDOARGANDOÑAHAYDEE",null,null,null,"Puno"]
[null,"Puno","1434.06","AREA DE GESTION INSTITUCIONAL","VALERIANOVALDEZMARIO MARIANO",null,null,null,"Puno"]
[65,"Puno","1434.06.01","JEFATURA AGI","VALERIANOVALDEZMARIO MARIANO",null,null,null,"Puno"]
[66,"Puno","1434.06.02","SECRETARIA AGI","MOLLOCONDOCHOQUENORMA",null,null,null,"Puno"]
[67,"Puno","1434.06.03","PLANIFICADOR","CACERESMAMANICELEDONIO NAZARIO",null,null,null,"Puno"]
[68,"Puno","1434.06.04","ESPECIALISTA EN ESTADISTICA","IGNACIOVELAZCOPAUL",null,null,null,"Puno"]
[69,"Puno","1434.06.05","ESPECILISTA EN PRESUPUESTO Y FINAZAS","ANCCORAMOSALIPIO RODRIGO",null,null,null,"Puno"]
[70,"Puno","1434.06.06","ESPECIALISTA EN RACIONALIZACION","MORANNPERCAMAGUIN",null,null,null,"Puno"]
[71,"Puno","1434.06.07","ESPECIALISTA EN INFRAESTRUCTURA","FERNANDEZGUTIERREZGUSTAVO VICTOR",null,null,null,"Puno"]
[72,"Puno","1434.06.08","RESPONSABLE DEL PROGRAMA ACCESO","CACERESMAMANICELEDONIO NAZARIO",null,null,null,"Puno"]
[73,"Puno","1434.06.09","DIR. SISTEMA ADM. I","GONZALESARESTEGUIJULIO REYNALDO",null,null,null,"Puno"]
[74,"Puno","1434.06.10","ESPECIALISTA DE MANTENIMIENTO DE LOCALES","MARCALIMACHINESTOR",null,null,null,"Puno"]
[75,"Puno","1434.06.11","ESPECIALISTA IIEE. PRIVADAS","BENITOLOPEZROXANA",null,null,null,"Puno"]

{"sheet":"ACTIVIDAD POI 2019","index":5,"n_rows":44,"n_cols":3,"rows_kept":44,"cut":false,"hidden":false,"merged":[]}
[]
["C004"," TALLER DE ACTUALIZACIÓN CON EL MINEDU-AGI- UGEL PUNO.",2.2999999999999998]
["C0005","FORTALECIMIENTO DE CAPACIDADES A DIRECTORES DE IE EN INSTRUMENTOS DE GESTION Y PROCESO DE RACIONALIZACION",2.2999999999999998]
["C0006","FORTALECIMIENTO DE CAPACIDADES A SERVIDORES DE LA UGEL",2.2999999999999998]
["C0007","MONITOREO Y ASISTENCIA A IIEE EN MANTENIMIENTO DE LOCALES ESCOLARES E INSTRUMENTOS DE GESTION",2.2999999999999998]
["C0008","ACTUALIZACION DEL PEL MEDIANTE EL COPALE",2.2999999999999998]
["C0009","SANEAMIENTO FISICO LEGAL DE PREDIOS ESCOLARES",2.2999999999999998]
["C0010"," EMISION DE LOS PROGRAMAS AGENDA EDUCATIVA EN RADIO Y TELEVISION 2018",2.2999999999999998]
["C0011","CEREMONIA DE RECONOCIMIENTO POR EL DIA DEL MAESTRO 2018",2.2999999999999998]
["C0012"," ELABORACION DE LA REVISTA INSTITUCIONAL",2.2999999999999998]
["C0013","CAMPAÑA DEL BUEN INICIO DEL AÑO ESCOLAR",2.2999999999999998]
["C0014","CEREMONIA POR FIESTAS PATRIAS DESFILE ESCOLAR",2.2999999999999998]
["C0015","JORNADAS DE ACTUALIZACION Y ASESORAMIENTO LEGAL PARA DIRECTORES DOCENTES PADRES DE FAMILIA ESTUDIANTES Y PERSONAL ADMINISTRATIVO",2.2999999999999998]
["C0016","DOTACION OPORTUNA DE MATERIALES EDUCATIVOS Y FUNGIBLES A LAS IE DEL AMBITO DE LA UGEL PUNO",2.2999999999999998]
["C0017","A CAPACITACION SOBRE MANEJO DE REGISTROS CONTABLES LIBRO CAJA INVENTARIOS B CAPACITACION SOBRE CONTROL DE ASISTENCIA Y PERMANENCIA DEL PERSONAL EN LAS IIEE PROCESOS DISCIPLINARIOS",2.2999999999999998]
["C0018","ASEGURAR EL FUNCIONAMIENTO DE LA SEDE ADMINISTRATIVA",2.2999999999999998]
["C0019","GARANTIZAR EL SERVICIO EDUCATIVO EN EL AMBITO PROVINCIAL",2.2999999999999998]
["C0003","GESTION ADMINISTRATIVA",2.2999999999999998]
["C0020","FORTALECIMIENTO Y DESARROLLO DE COMPETENCIAS Y CAPACIDADES DE DIRECTORES DE EBR PARA GARANTIZAR UNA OPTIMA GESTION PEDAGOGICA EN LAS IE Y PLANIFICACION CURRICULAR Y ESTRATEGIAS PARA DOCENTES DE EBR DIRECTORE Y ESPECIALISTAS",2.2999999999999998]
["C0021","SENSIBILIZACION Y ORIENTACION DE LA EVALUACION CENSAL Y ELABORACION DE MATERIALES REFERIDO A LA ECE NIVEL SECUNDARIA",2.2999999999999998]
["C0022","SENSIBILIZACION Y ORIENTACION DE LA EVALUACION CENSAL Y ELABORACION DE MATERIALES REFERIDO A LA ECE  ECELO NIVEL PRIMARIA",2.2999999999999998]
["C0023","TALLER DE FORTALECMIENTO DE CAPACIDADES EN EL MANEJO DE TIC PRIMARIA Y SECUNDARIA",2.2999999999999998]
["C0024","PREMIO NACIONAL DE NARRATIVA Y ENSAYO JOSE MARIA ARGUEDAS 2018",2.2999999999999998]
["C0025","CONCURSO DE ARGUMENTACION Y DEBATE PRODUCCION DE TEXTOS CUENTO Y POESIA A NIVEL DE DOCENTES 2018 BUENAS PRACTICAS A PARTIR DEL ESTUDIO DE CLASES AREA DE MATEMATICA ARGUMENTACION Y DEBATE REFLEXIONEMOS SOBRE LA INDEPENDENCIA DEL PERU I CONCURSO DE BIOGRAFIAS VIDA Y OBRAS DE PERSONAJES ILUSTRES DE MI LOCALIDAD Y CONCURSO DE ESTUDIANTINAS",2.2999999999999998]
["C0026","TALLER COMPRENSION LECTORA Y PRODUCCION DE TEXTOS AREA DE COMUNICACION EXPOSICION DE EDUCACION AMBIENTAL Y ACTUALIZACION DOCENTE ELABORACION DE MODULOS Y PROYECTOS E INTRUMENTOS DE EVALUACION 2018 ESTRATEGIAS METODOLOGICAS CONLA METODOLOGIA DE ESTUDIO DE CLASES CAPACIDADES DIGITALES PARA EL EJERCICIO CIUDADANO 2018  NIVEL SECUNDARIA",2.2999999999999998]
["C0027","XXVIII FENCYT EUREKA DISTRITAL PROVINCIAL Y REGIONALAREA DE CIENCIA Y TECNOLOGIAEDUCACION SECUNDARIA 2017",2.2999999999999998]
["C0028","FORTALECIMIENTO DE CAPACIDADES FISICAS RECREATIVAS Y VALORES A TRAVES DE LOS JUEGOS DEPORTIVOS ESCOLARES NACIONALES 2018",2.2999999999999998]
["C0029","II CARRERA PEDESTRE CORREDORES DEL TITICACA",2.2999999999999998]
["C0030","CONCURSO NACIONAL CREA Y EMPRENDE - AREA EDUCACION PARA EL TRABAJO TODAS LAS ETAPAS",2.2999999999999998]
["C0031","FORTALECIENDO NUESTRAS CAPACIDADES EN EL CURRICULO NACIONAL INSTRUMENTOS DE EVALUACION Y ESTRATEGIAS PARA LA MEJORA DE LOS APRENDIZAJES EN NIÑOS Y NIÑAS DEL NIVEL INICIAL",2.2999999999999998]
["C0032","DESARROLLANDO MIS HABILIDADES EN EL CIRCUITO MOTOR",2.2999999999999998]
["C0033","FORTALECIENDO NUESTRAS CAPACIDADES DEL NIVEL INICIAL PARA DOCENTES COODRINADORAS Y PROMOTORES EDUCATIVOS COM UNITARIOS",2.2999999999999998]
["C0034","XV ONEM 2018 SEGUNDA ETAPA- AREA DE MATEMATICA EDUCACION SECUNDARIA",2.2999999999999998]
["C0035","FORTALECIMIENTO Y DESARROLLO DE COMPETENCIAS Y CAPACIDADES DIRIGIDO A DIRECTORES COORDINADORES DE TUTORIA TUTORES Y AUXILIARES DE EDUCACION Y A LOS ESTUDIANTES PARA PROMOVER EL LIDERAZGO",2.2999999999999998]
["C0036","EXPERIENCIAS EXITOSAS POR UNA CONVIVENCIA SIN VIOLENCIA Y SUSCRIBIR CONVENION INSTITUCIONALES PARA PREVENIR TODO TIPO DE VIOLENCIA ESCOLAR",2.2999999999999998]
["C0037","FORTALECIENDO EL DESARROLLO DE LA CREATIVIDAD Y EXPRESIVIDAD MEDIANTE PRACTICAS ARTISTICAS CULTURALES Y TECNOLOGICAS",2.2999999999999998]
["C0038","DESDE LA ESCUELA PROMOVEMOS EL RECONOCIMIENTO Y RESPETO DE NUESTRA LENGUAS ORIGINARIAS AIMARA Y QUECHUA CONCURSO DE SPOT PUBLICITARIO SEMBRANDO SABERES DE MI COMUNIDAD SEGUNDO DIA DE LOGRO DEL AMBITO DE LA UGEL PUNO",2.2999999999999998]
["C0039","FORTALECIMIENTO DEL DOMINIO DE LENGUAS ORIGINARIAS AIMARA Y QUECHUA",2.2999999999999998]
["C0040"," EXAMEN ESPECIAL AL PROCESO DE MANTENIMIENTO DE LOCALES ESCOLARES Y AL PROCESO DE ADQUISICION Y DISTRIBUCION DE BBSS EN LAS IIEE AMBITO UGEL PUNO",2.2999999999999998]
["C0041","VISITAS INOPINADAS SOBRE EL MANEJO DE PRESUPUESTO DE MANTENIMIENTO DE LOCALES ESCOLARES Y SOBRE EL MANEJO DE RECURSOS PROPIOS",2.2999999999999998]
["C0042"," DESARROLLO DEL CICLO AVANZADO DE LA EDUCACION BASICA ALTERNATIVA BIENES Y SERVICIOS","2.3"]
["C0043","DESARROLLO DEL CICLO INTERMEDIO DE LA EDUCACION BASICA ALTERNATIVA BIENES Y SERVICIOS","2.3"]
["C0044","DESARROLLO DEL CICLO INTERMEDIO DE LA EDUCACION BASICA ALTERNATIVA BIENES Y SERVICIOS","2.3"]
["C0045"," FOMENTAR EL DEPORTE Y LA RECREACION","2.3"]

{"sheet":"INSTRUCTIVO","index":6,"n_rows":82,"n_cols":19,"rows_kept":82,"cut":false,"hidden":false,"merged":[[79,1,79,2],[79,4,79,7],[79,10,79,11],[79,12,79,13],[79,14,79,15],[80,1,80,2],[80,4,80,7],[80,10,80,11],[80,12,80,13],[80,14,80,15],[77,1,77,2],[77,4,77,7],[77,10,77,11],[77,12,77,13],[77,14,77,15],[78,1,78,2],[78,4,78,7],[78,10,78,11],[78,12,78,13],[78,14,78,15],[75,1,75,2],[75,4,75,7],[75,10,75,11],[75,12,75,13],[75,14,75,15],[76,1,76,2],[76,4,76,7],[76,10,76,11],[76,12,76,13],[76,14,76,15],[73,1,73,2],[73,4,73,7],[73,10,73,11],[73,12,73,13],[73,14,73,15],[74,1,74,2],[74,4,74,7],[74,10,74,11],[74,12,74,13],[74,14,74,15],[71,1,71,2],[71,4,71,7],[71,10,71,11],[71,12,71,13],[71,14,71,15],[72,1,72,2],[72,4,72,7],[72,10,72,11],[72,12,72,13],[72,14,72,15],[69,1,69,2],[69,4,69,7],[69,10,69,11],[69,12,69,13],[69,14,69,15],[70,1,70,2],[70,4,70,7],[70,10,70,11],[70,12,70,13],[70,14,70,15],[67,1,67,2],[67,4,67,7],[67,10,67,11],[67,12,67,13],[67,14,67,15],[68,1,68,2],[68,4,68,7],[68,10,68,11],[68,12,68,13],[68,14,68,15],[65,1,65,2],[65,4,65,7],[65,10,65,11],[65,12,65,13],[65,14,65,15],[66,1,66,2],[66,4,66,7],[66,10,66,11],[66,12,66,13],[66,14,66,15],[63,1,63,2],[63,4,63,7],[63,10,63,11],[63,12,63,13],[63,14,63,15],[64,1,64,2],[64,4,64,7],[64,10,64,11],[64,12,64,13],[64,14,64,15],[61,1,61,2],[61,4,61,7],[61,10,61,11],[61,12,61,13],[61,14,61,15],[62,1,62,2],[62,4,62,7],[62,10,62,11],[62,12,62,13],[62,14,62,15],[59,1,59,2],[59,4,59,7],[59,10,59,11],[59,12,59,13],[59,14,59,15],[60,1,60,2],[60,4,60,7],[60,10,60,11],[60,12,60,13],[60,14,60,15],[57,1,57,2],[57,4,57,7],[57,10,57,11],[57,12,57,13],[57,14,57,15],[58,1,58,2],[58,4,58,7],[58,10,58,11],[58,12,58,13],[58,14,58,15],[55,1,55,2],[55,4,55,7],[55,10,55,11],[55,12,55,13],[55,14,55,15],[56,1,56,2],[56,4,56,7],[56,10,56,11],[56,12,56,13],[56,14,56,15],[53,1,53,2],[53,4,53,7],[53,10,53,11],[53,12,53,13],[53,14,53,15],[54,1,54,2],[54,4,54,7],[54,10,54,11],[54,12,54,13],[54,14,54,15],[51,1,51,2],[51,4,51,7],[51,10,51,11],[51,12,51,13],[51,14,51,15],[52,1,52,2],[52,4,52,7],[52,10,52,11],[52,12,52,13],[52,14,52,15],[49,1,49,2],[49,4,49,7],[49,10,49,11],[49,12,49,13],[49,14,49,15],[50,1,50,2],[50,4,50,7],[50,10,50,11],[50,12,50,13],[50,14,50,15],[47,1,47,2],[47,4,47,7],[47,10,47,11],[47,12,47,13],[47,14,47,15],[48,1,48,2],[48,4,48,7],[48,10,48,11],[48,12,48,13],[48,14,48,15],[45,1,45,2],[45,4,45,7],[45,10,45,11],[45,12,45,13],[45,14,45,15],[46,1,46,2],[46,4,46,7],[46,10,46,11],[46,12,46,13],[46,14,46,15],[43,1,43,2],[43,4,43,7],[43,10,43,11],[43,12,43,13],[43,14,43,15],[44,1,44,2],[44,4,44,7],[44,10,44,11],[44,12,44,13],[44,14,44,15],[41,1,41,2],[41,4,41,7],[41,10,41,11],[41,12,41,13],[41,14,41,15],[42,1,42,2],[42,4,42,7],[42,10,42,11],[42,12,42,13],[42,14,42,15],[39,1,39,2],[39,4,39,7],[39,10,39,11],[39,12,39,13],[39,14,39,15],[40,1,40,2],[40,4,40,7],[40,10,40,11],[40,12,40,13],[40,14,40,15],[37,1,37,2],[37,4,37,7],[37,10,37,11],[37,12,37,13],[37,14,37,15],[38,1,38,2],[38,4,38,7],[38,10,38,11],[38,12,38,13],[38,14,38,15],[35,1,35,2],[35,4,35,7],[35,10,35,11],[35,12,35,13],[35,14,35,15],[36,1,36,2],[36,4,36,7],[36,10,36,11],[36,12,36,13],[36,14,36,15],[33,1,33,2],[33,4,33,7],[33,10,33,11],[33,12,33,13],[33,14,33,15],[34,1,34,2],[34,4,34,7],[34,10,34,11],[34,12,34,13],[34,14,34,15],[31,1,31,2],[31,4,31,7],[31,10,31,11],[31,12,31,13],[31,14,31,15],[32,1,32,2],[32,4,32,7],[32,10,32,11],[32,12,32,13],[32,14,32,15],[29,1,29,2],[29,4,29,7],[29,10,29,11],[29,12,29,13],[29,14,29,15],[30,1,30,2],[30,4,30,7],[30,10,30,11],[30,12,30,13],[30,14,30,15],[27,1,27,2],[27,4,27,7],[27,10,27,11],[27,12,27,13],[27,14,27,15],[28,1,28,2],[28,4,28,7],[28,10,28,11],[28,12,28,13],[28,14,28,15],[25,1,25,2],[25,4,25,7],[25,10,25,11],[25,12,25,13],[25,14,25,15],[26,1,26,2],[26,4,26,7],[26,10,26,11],[26,12,26,13],[26,14,26,15],[23,1,23,2],[23,4,23,7],[23,10,23,11],[23,12,23,13],[23,14,23,15],[24,1,24,2],[24,4,24,7],[24,10,24,11],[24,12,24,13],[24,14,24,15],[21,1,21,2],[21,4,21,7],[21,10,21,11],[21,12,21,13],[21,14,21,15],[22,1,22,2],[22,4,22,7],[22,10,22,11],[22,12,22,13],[22,14,22,15],[19,1,19,2],[19,4,19,7],[19,10,19,11],[19,12,19,13],[19,14,19,15],[20,1,20,2],[20,4,20,7],[20,10,20,11],[20,12,20,13],[20,14,20,15],[17,1,17,2],[17,4,17,7],[17,10,17,11],[17,12,17,13],[17,14,17,15],[18,1,18,2],[18,4,18,7],[18,10,18,11],[18,12,18,13],[18,14,18,15],[15,1,15,2],[15,4,15,7],[15,10,15,11],[15,12,15,13],[15,14,15,15],[16,1,16,2],[16,4,16,7],[16,10,16,11],[16,12,16,13],[16,14,16,15],[13,1,13,2],[13,4,13,7],[13,10,13,11],[13,12,13,13],[13,14,13,15],[14,1,14,2],[14,4,14,7],[14,10,14,11],[14,12,14,13],[14,14,14,15],[11,1,11,2],[11,4,11,7],[11,10,11,11],[11,12,11,13],[11,14,11,15],[12,1,12,2],[12,4,12,7],[12,10,12,11],[12,12,12,13],[12,14,12,15],[9,1,9,2],[9,4,9,7],[9,10,9,11],[9,12,9,13],[9,14,9,15],[10,1,10,2],[10,4,10,7],[10,10,10,11],[10,12,10,13],[10,14,10,15],[0,4,0,14],[0,15,0,16],[0,17,0,18],[1,4,1,14],[1,15,1,16],[1,17,1,18],[6,0,6,4],[6,16,6,17],[7,0,7,2],[7,4,7,5],[7,7,7,8],[3,0,3,2],[3,7,3,8],[3,10,3,13],[3,14,3,15],[4,0,4,3],[5,0,5,2],[5,4,5,8],[5,10,5,13],[5,14,5,15],[7,10,7,15]]}
[null,null,null,null,"UNIDAD DE GESTION EDUCATIVA LOCAL PUNO UE 311"]
[null,null,null,null,"CUADRO DE NECESIDADES 2019",null,null,null,null,null,null,null,null,null,null,null,null,"CARV($E$4;CENTRO_COSTO!$C$2:$K$888;10;FALSO)"]
[]
["Codigo Centro de Costo",null,null,null,"1434.04.03",null,"Numero de Celular","980890282",null,null,"Nº  Personas",null,null,null,5]
[]
["Centro de Costos",null,null,null,{"$f":"+VLOOKUP($E$4,CENTRO_COSTO!$C$2:$D$888,2,FALSE)","v":"OFICINA DE ABASTECIMIENTOS"},null,null,null,null,null,"Actividad de POI",null,null,null,null,null,null,{"$f":"IF(E4=\"\",\"\",VLOOKUP(E4,PERSONAL,5,FALSE))","v":38222}]
[]
["Nombres y Apellidos ",null,null,null,{"$f":"IF(E4=\"\",\"\",VLOOKUP(E4,PERSONAL,4,FALSE))","v":"QUISPEFRISANCHOELAR PABLO"},null,"Correo Electronico","ro2g2@hotmail.com",null,null,"Actividad Administrativa",null,null,null,null,null," - Aprobado",{"$f":"SUM(R11:R81)","v":360}]
[]
["CODIGO INTERNO","Clasificador de Gasto",null,"CATALOGO SIGA","DESCRIPCIÓN",null,null,null,"Unidad\nde medida","Precio Estimado","I DOTACION\nENE - ABR",null,"II DOTACION\nJUN - AGOT",null,"III DOTACION\nSET - DIC",null,"CANTIDAD","TOTAL","OBSERVACIONES"]
[1,null,null,{"$f":"IF(A11=\"\",\"\",VLOOKUP(A11,CATALOGO,2,FALSE))","v":"133000410156"},{"$f":"IF(A11=\"\",\"\",VLOOKUP(A11,CATALOGO,3,FALSE))","v":"ALCOHOL SPRAY X 400 mL"},null,null,null,{"$f":"IF(A11=\"\",\"\",VLOOKUP(A11,CATALOGO,4,FALSE))","v":"UNIDAD"},{"$f":"IF(D11=\"\",\"\",VLOOKUP(D11,CATALOGO!$B$2:$E$333,4,FALSE))","v":12},10,null,10,null,10,null,{"$f":"IF(A11=\"\",\"\",(N11+O11+P11+K11+M11))","v":30},{"$f":"IF(J11=\"\",\"\",(J11*Q11))","v":360}]
[2,null,null,"133000140205",{"$f":"IF(A12=\"\",\"\",VLOOKUP(A12,CATALOGO,3,FALSE))","v":"AMBIENTADOR EN PASTILLA PARA BAÑO X 40 gr APROX."},null,null,null,{"$f":"IF(A12=\"\",\"\",VLOOKUP(A12,CATALOGO,4,FALSE))","v":"UNIDAD"},{"$f":"IF(D12=\"\",\"\",VLOOKUP(D12,CATALOGO!$B$2:$E$333,4,FALSE))","v":7},null,null,null,null,null,null,{"$f":"IF(A12=\"\",\"\",(N12+O12+P12+K12+M12))","v":0},0]
[3,null,null,"133000140079","AMBIENTADOR EN SPRAY X 360 mL",null,null,null,"UNIDAD",{"$f":"IF(D13=\"\",\"\",VLOOKUP(D13,CATALOGO!$B$2:$E$333,4,FALSE))","v":7},null,null,null,null,null,null,0,0]
[4,null,null,"133000140077","AMBIENTADOR EN SPRAY X 400 mL APROX.",null,null,null,"UNIDAD",{"$f":"IF(D14=\"\",\"\",VLOOKUP(D14,CATALOGO!$B$2:$E$333,4,FALSE))","v":7},null,null,null,null,null,null,0,0]
[5,null,null,"133000140091","AMBIENTADOR EN SPRAY X 650 mL",null,null,null,"UNIDAD",{"$f":"IF(D15=\"\",\"\",VLOOKUP(D15,CATALOGO!$B$2:$E$333,4,FALSE))","v":7},null,null,null,null,null,null,0,0]
[6,null,null,"710600010009","ARCHIVADOR DE CARTON CON PALANCA LOMO ANCHO TAMAÑO MEDIO OFICIO",null,null,null,"UNIDAD",{"$f":"IF(D16=\"\",\"\",VLOOKUP(D16,CATALOGO!$B$2:$E$333,4,FALSE))","v":4},null,null,null,null,null,null,0,0]
[7,null,null,"710600010012","ARCHIVADOR DE CARTON CON PALANCA LOMO ANCHO TAMAÑO OFICIO",null,null,null,"UNIDAD",{"$f":"IF(D17=\"\",\"\",VLOOKUP(D17,CATALOGO!$B$2:$E$333,4,FALSE))","v":3.66},null,null,null,null,null,null,0,0]
[8,null,null,"710600010014","ARCHIVADOR DE CARTON CON PALANCA LOMO ANGOSTO TAMAÑO MEDIO OFICIO",null,null,null,"UNIDAD",{"$f":"IF(D18=\"\",\"\",VLOOKUP(D18,CATALOGO!$B$2:$E$333,4,FALSE))","v":4},null,null,null,null,null,null,0,0]
[9,null,null,"283400060097","BATERIA 13 PLACAS 12 V 75 A",null,null,null,"UNIDAD",{"$f":"IF(D19=\"\",\"\",VLOOKUP(D19,CATALOGO!$B$2:$E$333,4,FALSE))","v":335},null,null,null,null,null,null,0,0]
[10,null,null,"283400060228","BATERIA 15 PLACAS 12 V 1000 A",null,null,null,"UNIDAD",{"$f":"IF(D20=\"\",\"\",VLOOKUP(D20,CATALOGO!$B$2:$E$333,4,FALSE))","v":320},null,null,null,null,null,null,0,0]
[11,null,null,"716000010022","BOLIGRAFO (LAPICERO) DE TINTA LIQUIDA PUNTA FINA COLOR  AZUL",null,null,null,"UNIDAD",{"$f":"IF(D21=\"\",\"\",VLOOKUP(D21,CATALOGO!$B$2:$E$333,4,FALSE))","v":2.8},null,null,null,null,null,null,0,0]
[12,null,null,"716000010001","BOLIGRAFO (LAPICERO) DE TINTA LIQUIDA PUNTA FINA COLOR  NEGRO",null,null,null,"UNIDAD",{"$f":"IF(D22=\"\",\"\",VLOOKUP(D22,CATALOGO!$B$2:$E$333,4,FALSE))","v":2.8},null,null,null,null,null,null,0,0]
[13,null,null,"716000010002","BOLIGRAFO (LAPICERO) DE TINTA LIQUIDA PUNTA FINA COLOR  ROJO",null,null,null,"UNIDAD",{"$f":"IF(D23=\"\",\"\",VLOOKUP(D23,CATALOGO!$B$2:$E$333,4,FALSE))","v":2.8},null,null,null,null,null,null,0,0]
[14,null,null,"716000010196","BOLIGRAFO (LAPICERO) DE TINTA SECA PUNTA MEDIA",null,null,null,"UNIDAD",{"$f":"IF(D24=\"\",\"\",VLOOKUP(D24,CATALOGO!$B$2:$E$333,4,FALSE))","v":0.77},null,null,null,null,null,null,0,0]
[15,null,null,"716000010212","BOLIGRAFO (LAPICERO) DE TINTA SECA PUNTA MEDIA COLOR  AZUL",null,null,null,"UNIDAD",{"$f":"IF(D25=\"\",\"\",VLOOKUP(D25,CATALOGO!$B$2:$E$333,4,FALSE))","v":0.4},null,null,null,null,null,null,0,0]
[16,null,null,"716000010213","BOLIGRAFO (LAPICERO) DE TINTA SECA PUNTA MEDIA COLOR  NEGRO",null,null,null,"UNIDAD",{"$f":"IF(D26=\"\",\"\",VLOOKUP(D26,CATALOGO!$B$2:$E$333,4,FALSE))","v":0.4},null,null,null,null,null,null,0,0]
[17,null,null,"716000010214","BOLIGRAFO (LAPICERO) DE TINTA SECA PUNTA MEDIA COLOR  ROJO",null,null,null,"UNIDAD",{"$f":"IF(D27=\"\",\"\",VLOOKUP(D27,CATALOGO!$B$2:$E$333,4,FALSE))","v":0.4},null,null,null,null,null,null,0,0]
[18,null,null,"716000010222","BOLIGRAFO (LAPICERO) DE TINTA SECA PUNTA MEDIA COLOR AZUL",null,null,null,"EMPAQUE X 50",{"$f":"IF(D28=\"\",\"\",VLOOKUP(D28,CATALOGO!$B$2:$E$333,4,FALSE))","v":24},null,null,null,null,null,null,0,0]
[19,null,null,"716000010223","BOLIGRAFO (LAPICERO) DE TINTA SECA PUNTA MEDIA COLOR ROJO.",null,null,null,"EMPAQUE X 50",{"$f":"IF(D29=\"\",\"\",VLOOKUP(D29,CATALOGO!$B$2:$E$333,4,FALSE))","v":24},null,null,null,null,null,null,0,0]
[20,null,null,"711100010028","BORRADOR BLANCO PARA LAPIZ TAMAÑO CHICO",null,null,null,"UNIDAD",{"$f":"IF(D30=\"\",\"\",VLOOKUP(D30,CATALOGO!$B$2:$E$333,4,FALSE))","v":0.37},null,null,null,null,null,null,0,0]
[21,null,null,"711100010008","BORRADOR MIXTO TAMAÑO GRANDE",null,null,null,"UNIDAD",{"$f":"IF(D31=\"\",\"\",VLOOKUP(D31,CATALOGO!$B$2:$E$333,4,FALSE))","v":0.8},null,null,null,null,null,null,0,0]
[22,null,null,"717300110160","CARTON PRENSADO N° 8 DE 70 cm X 100 cm",null,null,null,"UNIDAD",{"$f":"IF(D32=\"\",\"\",VLOOKUP(D32,CATALOGO!$B$2:$E$333,4,FALSE))","v":8},null,null,null,null,null,null,0,0]
[23,null,null,"717300110328","CARTULINA CORRUGADA 100 g DE 50 cm X 70 cm DE COLOR",null,null,null,"UNIDAD",{"$f":"IF(D33=\"\",\"\",VLOOKUP(D33,CATALOGO!$B$2:$E$333,4,FALSE))","v":0.24},null,null,null,null,null,null,0,0]
[24,null,null,"717300110043","CARTULINA PLASTIFICADA DE 50 cm X 60 cm",null,null,null,"UNIDAD",{"$f":"IF(D34=\"\",\"\",VLOOKUP(D34,CATALOGO!$B$2:$E$333,4,FALSE))","v":0.24},null,null,null,null,null,null,0,0]
[25,null,null,"717300110094","CARTULINA PLASTIFICADA DE 50 cm X 65 cm COLOR AZUL",null,null,null,"UNIDAD",{"$f":"IF(D35=\"\",\"\",VLOOKUP(D35,CATALOGO!$B$2:$E$333,4,FALSE))","v":0.24},null,null,null,null,null,null,0,0]
[26,null,null,"717300110188","CARTULINA SATINADA 150 g  DE 70 cm X 100 cm",null,null,null,"UNIDAD",{"$f":"IF(D36=\"\",\"\",VLOOKUP(D36,CATALOGO!$B$2:$E$333,4,FALSE))","v":0.5},null,null,null,null,null,null,0,0]
[27,null,null,"717300110032","CARTULINA SATINADA 150 g DE 50 cm X 65 cm",null,null,null,"UNIDAD",{"$f":"IF(D37=\"\",\"\",VLOOKUP(D37,CATALOGO!$B$2:$E$333,4,FALSE))","v":0.5},null,null,null,null,null,null,0,0]
[28,null,null,"717300110332","CARTULINA SATINADA 150 g DE 50 cm X 65 cm  COLOR BLANCO",null,null,null,"CIENTO",{"$f":"IF(D38=\"\",\"\",VLOOKUP(D38,CATALOGO!$B$2:$E$333,4,FALSE))","v":0.5},null,null,null,null,null,null,0,0]
[29,null,null,"717300110097","CARTULINA SATINADA 150 g DE 50 cm X 65 cm COLOR BLANCO",null,null,null,"UNIDAD",{"$f":"IF(D39=\"\",\"\",VLOOKUP(D39,CATALOGO!$B$2:$E$333,4,FALSE))","v":0.5},null,null,null,null,null,null,0,0]
[30,null,null,"717300110165","CARTULINA SATINADA 150 g DE 50 cm X 65 cm COLOR NEGRO",null,null,null,"UNIDAD",{"$f":"IF(D40=\"\",\"\",VLOOKUP(D40,CATALOGO!$B$2:$E$333,4,FALSE))","v":0.5},null,null,null,null,null,null,0,0]
[31,null,null,"717300110042","CARTULINA SATINADA 150 g DE 70 cm X 100 cm COLOR BLANCO",null,null,null,"UNIDAD",{"$f":"IF(D41=\"\",\"\",VLOOKUP(D41,CATALOGO!$B$2:$E$333,4,FALSE))","v":0.5},null,null,null,null,null,null,0,0]
[32,null,null,"717300110089","CARTULINA SIMPLE 120 g DE 70 cm X 100 cm COLOR BLANCO",null,null,null,"UNIDAD",{"$f":"IF(D42=\"\",\"\",VLOOKUP(D42,CATALOGO!$B$2:$E$333,4,FALSE))","v":0.3},null,null,null,null,null,null,0,0]
[33,null,null,"717300110329","CARTULINA SIMPLE 140 g 50 cm X 65 cm COLOR BLANCO",null,null,null,"UNIDAD",{"$f":"IF(D43=\"\",\"\",VLOOKUP(D43,CATALOGO!$B$2:$E$333,4,FALSE))","v":0.31859999999999999},null,null,null,null,null,null,0,{"$f":"IF(J43=\"\",\"\",(J43*Q43))","v":0}]
[34,null,null,"717300110331","CARTULINA SIMPLE 140 g 50 cm X 65 cm COLOR NEGRO",null,null,null,"UNIDAD",{"$f":"IF(D44=\"\",\"\",VLOOKUP(D44,CATALOGO!$B$2:$E$333,4,FALSE))","v":0.31859999999999999},null,null,null,null,null,null,0,0]
[35,null,null,"717300110403","CARTULINA SIMPLE 140 g 50 cm X 65 cm COLOR RAL 1016",null,null,null,"UNIDAD",{"$f":"IF(D45=\"\",\"\",VLOOKUP(D45,CATALOGO!$B$2:$E$333,4,FALSE))","v":0.255},null,null,null,null,null,null,0,0]
[36,null,null,"717300110404","CARTULINA SIMPLE 140 g 50 cm X 65 cm COLOR RAL 5015",null,null,null,"UNIDAD",{"$f":"IF(D46=\"\",\"\",VLOOKUP(D46,CATALOGO!$B$2:$E$333,4,FALSE))","v":0.25509999999999999},null,null,null,null,null,null,0,0]
[37,null,null,"717300110405","CARTULINA SIMPLE 140 g 50 cm X 65 cm COLOR RAL 6001",null,null,null,"UNIDAD",{"$f":"IF(D47=\"\",\"\",VLOOKUP(D47,CATALOGO!$B$2:$E$333,4,FALSE))","v":0.25509999999999999},null,null,null,null,null,null,0,0]
[38,null,null,"717300110330","CARTULINA SIMPLE 140 g 50 cm X 65 cm DE COLORES",null,null,null,"UNIDAD",{"$f":"IF(D48=\"\",\"\",VLOOKUP(D48,CATALOGO!$B$2:$E$333,4,FALSE))","v":0.3},null,null,null,null,null,null,0,0]
[39,null,null,"717300110270","CARTULINA SIMPLE 145 g DE 50 cm X 56 cm COLOR AMARILLO",null,null,null,"UNIDAD",{"$f":"IF(D49=\"\",\"\",VLOOKUP(D49,CATALOGO!$B$2:$E$333,4,FALSE))","v":0.3},null,null,null,null,null,null,0,0]
[40,null,null,"717300110266","CARTULINA SIMPLE 145 g DE 50 cm X 56 cm COLOR BLANCO",null,null,null,"UNIDAD",{"$f":"IF(D50=\"\",\"\",VLOOKUP(D50,CATALOGO!$B$2:$E$333,4,FALSE))","v":0.3},null,null,null,null,null,null,0,0]
[41,null,null,"717300110268","CARTULINA SIMPLE 145 g DE 50 cm X 56 cm COLOR CELESTE",null,null,null,"UNIDAD",{"$f":"IF(D51=\"\",\"\",VLOOKUP(D51,CATALOGO!$B$2:$E$333,4,FALSE))","v":0.3},null,null,null,null,null,null,0,0]
[42,null,null,"717300110267","CARTULINA SIMPLE 145 g DE 50 cm X 56 cm COLOR ROSADO",null,null,null,"UNIDAD",{"$f":"IF(D52=\"\",\"\",VLOOKUP(D52,CATALOGO!$B$2:$E$333,4,FALSE))","v":0.3},null,null,null,null,null,null,0,0]
[43,null,null,"717300110269","CARTULINA SIMPLE 145 g DE 50 cm X 56 cm COLOR VERDE",null,null,null,"UNIDAD",{"$f":"IF(D53=\"\",\"\",VLOOKUP(D53,CATALOGO!$B$2:$E$333,4,FALSE))","v":0.3},null,null,null,null,null,null,0,0]
[44,null,null,"717300110337","CARTULINA SIMPLE 145 g DE 50 cm X 65 cm COLOR BLANCA",null,null,null,"UNIDAD",{"$f":"IF(D54=\"\",\"\",VLOOKUP(D54,CATALOGO!$B$2:$E$333,4,FALSE))","v":0.3},null,null,null,null,null,null,0,0]
[45,null,null,"717300110363","CARTULINA SIMPLE 145 g TAMAÑO  A4",null,null,null,"CIENTO",{"$f":"IF(D55=\"\",\"\",VLOOKUP(D55,CATALOGO!$B$2:$E$333,4,FALSE))","v":3},null,null,null,null,null,null,0,0]
[46,null,null,"717300110342","CARTULINA SIMPLE 150 g 70 cm X 100 cm COLOR AMARILLO",null,null,null,"UNIDAD",{"$f":"IF(D56=\"\",\"\",VLOOKUP(D56,CATALOGO!$B$2:$E$333,4,FALSE))","v":0.4},null,null,null,null,null,null,0,0]
[47,null,null,"717300110002","CARTULINA SIMPLE 150 g DE 50 cm X 65 cm",null,null,null,"UNIDAD",{"$f":"IF(D57=\"\",\"\",VLOOKUP(D57,CATALOGO!$B$2:$E$333,4,FALSE))","v":0.4},null,null,null,null,null,null,0,0]
[48,null,null,"717300110034","CARTULINA SIMPLE 150 g DE 50 cm X 65 cm COLOR AMARILLO",null,null,null,"UNIDAD",{"$f":"IF(D58=\"\",\"\",VLOOKUP(D58,CATALOGO!$B$2:$E$333,4,FALSE))","v":0.4},null,null,null,null,null,null,0,0]
[49,null,null,"717300110226","CARTULINA SIMPLE 150 g DE 50 cm X 65 cm COLOR AZUL",null,null,null,"UNIDAD",{"$f":"IF(D59=\"\",\"\",VLOOKUP(D59,CATALOGO!$B$2:$E$333,4,FALSE))","v":0.4},null,null,null,null,null,null,0,0]
[50,null,null,"717300110035","CARTULINA SIMPLE 150 g DE 50 cm X 65 cm COLOR BLANCO",null,null,null,"UNIDAD",{"$f":"IF(D60=\"\",\"\",VLOOKUP(D60,CATALOGO!$B$2:$E$333,4,FALSE))","v":0.4},null,null,null,null,null,null,0,0]
[51,null,null,"717300110036","CARTULINA SIMPLE 150 g DE 50 cm X 65 cm COLOR CELESTE",null,null,null,"UNIDAD",{"$f":"IF(D61=\"\",\"\",VLOOKUP(D61,CATALOGO!$B$2:$E$333,4,FALSE))","v":0.4},null,null,null,null,null,null,0,0]
[52,null,null,"717300110313","CARTULINA SIMPLE 150 g DE 50 cm X 65 cm COLOR MARRÓN",null,null,null,"UNIDAD",{"$f":"IF(D62=\"\",\"\",VLOOKUP(D62,CATALOGO!$B$2:$E$333,4,FALSE))","v":0.4},null,null,null,null,null,null,0,0]
[53,null,null,"717300110135","CARTULINA SIMPLE 150 g DE 50 cm X 65 cm COLOR ROJO",null,null,null,"UNIDAD",{"$f":"IF(D63=\"\",\"\",VLOOKUP(D63,CATALOGO!$B$2:$E$333,4,FALSE))","v":0.4},null,null,null,null,null,null,0,0]
[54,null,null,"717300110092","CARTULINA SIMPLE 150 g DE 50 cm X 65 cm COLOR ROSADO",null,null,null,"UNIDAD",{"$f":"IF(D64=\"\",\"\",VLOOKUP(D64,CATALOGO!$B$2:$E$333,4,FALSE))","v":0.4},null,null,null,null,null,null,0,0]
[55,null,null,"717300110091","CARTULINA SIMPLE 150 g DE 50 cm X 65 cm COLOR VERDE",null,null,null,"UNIDAD",{"$f":"IF(D65=\"\",\"\",VLOOKUP(D65,CATALOGO!$B$2:$E$333,4,FALSE))","v":0.4},null,null,null,null,null,null,0,0]
[56,null,null,"717300110285","CARTULINA SIMPLE 150 g DE 70 cm X 100 cm COLOR BLANCO",null,null,null,"CIENTO",{"$f":"IF(D66=\"\",\"\",VLOOKUP(D66,CATALOGO!$B$2:$E$333,4,FALSE))","v":3},null,null,null,null,null,null,0,0]
[57,null,null,"717300110019","CARTULINA SIMPLE 150 g TAMAÑO A4",null,null,null,"CIENTO",{"$f":"IF(D67=\"\",\"\",VLOOKUP(D67,CATALOGO!$B$2:$E$333,4,FALSE))","v":3},null,null,null,null,null,null,0,0]
[58,null,null,"717300110125","CARTULINA SIMPLE 150 g TAMAÑO A5 COLOR AMARILLO",null,null,null,"UNIDAD",{"$f":"IF(D68=\"\",\"\",VLOOKUP(D68,CATALOGO!$B$2:$E$333,4,FALSE))","v":0.5},null,null,null,null,null,null,0,0]
[59,null,null,"717300110121","CARTULINA SIMPLE 150 g TAMAÑO A5 COLOR BLANCO",null,null,null,"UNIDAD",{"$f":"IF(D69=\"\",\"\",VLOOKUP(D69,CATALOGO!$B$2:$E$333,4,FALSE))","v":0.5},null,null,null,null,null,null,0,0]
[60,null,null,"717300110123","CARTULINA SIMPLE 150 g TAMAÑO A5 COLOR CELESTE",null,null,null,"UNIDAD",{"$f":"IF(D70=\"\",\"\",VLOOKUP(D70,CATALOGO!$B$2:$E$333,4,FALSE))","v":0.5},null,null,null,null,null,null,0,0]
[61,null,null,"717300110122","CARTULINA SIMPLE 150 g TAMAÑO A5 COLOR ROSADO",null,null,null,"UNIDAD",{"$f":"IF(D71=\"\",\"\",VLOOKUP(D71,CATALOGO!$B$2:$E$333,4,FALSE))","v":0.5},null,null,null,null,null,null,0,0]
[62,null,null,"717300110124","CARTULINA SIMPLE 150 g TAMAÑO A5 COLOR VERDE",null,null,null,"UNIDAD",{"$f":"IF(D72=\"\",\"\",VLOOKUP(D72,CATALOGO!$B$2:$E$333,4,FALSE))","v":0.5},null,null,null,null,null,null,0,0]
[63,null,null,"717300110039","CARTULINA SIMPLE 160 g DE 50 cm X 65 cm",null,null,null,"UNIDAD",{"$f":"IF(D73=\"\",\"\",VLOOKUP(D73,CATALOGO!$B$2:$E$333,4,FALSE))","v":0.4},null,null,null,null,null,null,0,0]
[64,null,null,"717300110013","CARTULINA SIMPLE 160 g DE 61 cm X 86 cm",null,null,null,"UNIDAD",{"$f":"IF(D74=\"\",\"\",VLOOKUP(D74,CATALOGO!$B$2:$E$333,4,FALSE))","v":0.4},null,null,null,null,null,null,0,0]
[65,null,null,{"$f":"IF(A75=\"\",\"\",VLOOKUP(A75,CATALOGO,2,FALSE))","v":"717300110070"},"CARTULINA SIMPLE 160 g DE 65 cm X 50 cm COLOR NEGRO",null,null,null,{"$f":"IF(A75=\"\",\"\",VLOOKUP(A75,CATALOGO,4,FALSE))","v":"UNIDAD"},{"$f":"IF(D75=\"\",\"\",VLOOKUP(D75,CATALOGO!$B$2:$E$333,4,FALSE))","v":0.4},null,null,null,null,null,null,0,{"$f":"IF(J75=\"\",\"\",(J75*Q75))","v":0}]
[66,null,null,"717300110009",{"$f":"IF(A76=\"\",\"\",VLOOKUP(A76,CATALOGO,3,FALSE))","v":"CARTULINA SIMPLE 165 g DE 65 cm X 50 cm"},null,null,null,"UNIDAD",{"$f":"IF(D76=\"\",\"\",VLOOKUP(D76,CATALOGO!$B$2:$E$333,4,FALSE))","v":0.4},null,null,null,null,null,null,{"$f":"IF(A76=\"\",\"\",(N76+O76+P76+K76+M76))","v":0},0]
[null,null,null,"","",null,null,null,"",{"$f":"IF(D77=\"\",\"\",VLOOKUP(D77,CATALOGO!$B$2:$E$333,4,FALSE))","v":""},null,null,null,null,null,null,"",""]
[null,null,null,"","",null,null,null,"",{"$f":"IF(D78=\"\",\"\",VLOOKUP(D78,CATALOGO!$B$2:$E$333,4,FALSE))","v":""},null,null,null,null,null,null,"",""]
[null,null,null,"","",null,null,null,"",{"$f":"IF(D79=\"\",\"\",VLOOKUP(D79,CATALOGO!$B$2:$E$333,4,FALSE))","v":""},null,null,null,null,null,null,"",""]
[null,null,null,"","",null,null,null,"",{"$f":"IF(D80=\"\",\"\",VLOOKUP(D80,CATALOGO!$B$2:$E$333,4,FALSE))","v":""},null,null,null,null,null,null,"",""]
[null,null,null,"","",null,null,null,"",{"$f":"IF(D81=\"\",\"\",VLOOKUP(D81,CATALOGO!$B$2:$E$333,4,FALSE))","v":""},null,null,null,null,null,null,"",""]
[null,null,null,null,null,null,null,null,null,null,null,null,null,null,null,null,null,{"$f":"SUM(R11:R81)","v":360}]