{"text_format":"1","workbook":"xlsx","n_sheets":7,"sheets":["CN 2019_BIENES","CN_2019_SERVICOS","CENTRO DE COSTOS","CATALOGO","CENTRO_COSTO","ACTIVIDAD POI 2019","INSTRUCTIVO"],"not_rendered":{"charts":0,"images":3,"macros":1,"external_links":1,"defined_names":25,"comments":0,"pivot_tables":0},"unopened":[],"bounds":{"document_bytes":16777216,"sheet_cells":100000,"rows_first":2000,"rows_last":500,"rows_between":2000,"halvings":0,"cell_chars":16384,"cell_head_chars":4096},"cells_cut":0,"cells_raw":0,"read":"whole","date_system":"1900"}

{"sheet":"CN 2019_BIENES","index":0,"n_rows":82,"n_cols":19,"rows_kept":82,"cut":false,"hidden":false,"merged":[[0,4,0,14],[0,15,0,16],[0,17,0,18],[1,4,1,14],[1,15,1,16],[1,17,1,18],[6,0,6,4],[6,16,6,17],[7,0,7,2],[7,4,7,5],[7,7,7,8],[7,10,7,15],[3,0,3,2],[3,7,3,8],[3,10,3,13],[3,14,3,15],[4,0,4,3],[5,0,5,2],[5,4,5,8],[5,10,5,13],[5,14,5,15],[9,1,9,2],[9,4,9,7],[9,10,9,11],[9,12,9,13],[9,14,9,15],[10,1,10,2],[10,4,10,7],[10,10,10,11],[10,12,10,13],[10,14,10,15],[11,1,11,2],[11,4,11,7],[11,10,11,11],[11,12,11,13],[11,14,11,15],[12,1,12,2],[12,4,12,7],[12,10,12,11],[12,12,12,13],[12,14,12,15],[13,1,13,2],[13,4,13,7],[13,10,13,11],[13,12,13,13],[13,14,13,15],[14,1,14,2],[14,4,14,7],[14,10,14,11],[14,12,14,13],[14,14,14,15],[15,1,15,2],[15,4,15,7],[15,10,15,11],[15,12,15,13],[15,14,15,15],[16,1,16,2],[16,4,16,7],[16,10,16,11],[16,12,16,13],[16,14,16,15],[17,1,17,2],[17,4,17,7],[17,10,17,11],[17,12,17,13],[17,14,17,15],[18,1,18,2],[18,4,18,7],[18,10,18,11],[18,12,18,13],[18,14,18,15],[19,1,19,2],[19,4,19,7],[19,10,19,11],[19,12,19,13],[19,14,19,15],[20,1,20,2],[20,4,20,7],[20,10,20,11],[20,12,20,13],[20,14,20,15],[21,1,21,2],[21,4,21,7],[21,10,21,11],[21,12,21,13],[21,14,21,15],[22,1,22,2],[22,4,22,7],[22,10,22,11],[22,12,22,13],[22,14,22,15],[23,1,23,2],[23,4,23,7],[23,10,23,11],[23,12,23,13],[23,14,23,15],[24,1,24,2],[24,4,24,7],[24,10,24,11],[24,12,24,13],[24,14,24,15],[25,1,25,2],[25,4,25,7],[25,10,25,11],[25,12,25,13],[25,14,25,15],[26,1,26,2],[26,4,26,7],[26,10,26,11],[26,12,26,13],[26,14,26,15],[27,1,27,2],[27,4,27,7],[27,10,27,11],[27,12,27,13],[27,14,27,15],[28,1,28,2],[28,4,28,7],[28,10,28,11],[28,12,28,13],[28,14,28,15],[29,1,29,2],[29,4,29,7],[29,10,29,11],[29,12,29,13],[29,14,29,15],[30,1,30,2],[30,4,30,7],[30,10,30,11],[30,12,30,13],[30,14,30,15],[31,1,31,2],[31,4,31,7],[31,10,31,11],[31,12,31,13],[31,14,31,15],[32,1,32,2],[32,4,32,7],[32,10,32,11],[32,12,32,13],[32,14,32,15],[33,1,33,2],[33,4,33,7],[33,10,33,11],[33,12,33,13],[33,14,33,15],[34,1,34,2],[34,4,34,7],[34,10,34,11],[34,12,34,13],[34,14,34,15],[35,1,35,2],[35,4,35,7],[35,10,35,11],[35,12,35,13],[35,14,35,15],[36,1,36,2],[36,4,36,7],[36,10,36,11],[36,12,36,13],[36,14,36,15],[37,1,37,2],[37,4,37,7],[37,10,37,11],[37,12,37,13],[37,14,37,15],[38,1,38,2],[38,4,38,7],[38,10,38,11],[38,12,38,13],[38,14,38,15],[39,1,39,2],[39,4,39,7],[39,10,39,11],[39,12,39,13],[39,14,39,15],[40,1,40,2],[40,4,40,7],[40,10,40,11],[40,12,40,13],[40,14,40,15],[41,1,41,2],[41,4,41,7],[41,10,41,11],[41,12,41,13],[41,14,41,15],[42,1,42,2],[42,4,42,7],[42,10,42,11],[42,12,42,13],[42,14,42,15],[43,1,43,2],[43,4,43,7],[43,10,43,11],[43,12,43,13],[43,14,43,15],[44,1,44,2],[44,4,44,7],[44,10,44,11],[44,12,44,13],[44,14,44,15],[45,1,45,2],[45,4,45,7],[45,10,45,11],[45,12,45,13],[45,14,45,15],[46,1,46,2],[46,4,46,7],[46,10,46,11],[46,12,46,13],[46,14,46,15],[47,1,47,2],[47,4,47,7],[47,10,47,11],[47,12,47,13],[47,14,47,15],[48,1,48,2],[48,4,48,7],[48,10,48,11],[48,12,48,13],[48,14,48,15],[49,1,49,2],[49,4,49,7],[49,10,49,11],[49,12,49,13],[49,14,49,15],[50,1,50,2],[50,4,50,7],[50,10,50,11],[50,12,50,13],[50,14,50,15],[51,1,51,2],[51,4,51,7],[51,10,51,11],[51,12,51,13],[51,14,51,15],[52,1,52,2],[52,4,52,7],[52,10,52,11],[52,12,52,13],[52,14,52,15],[53,1,53,2],[53,4,53,7],[53,10,53,11],[53,12,53,13],[53,14,53,15],[54,1,54,2],[54,4,54,7],[54,10,54,11],[54,12,54,13],[54,14,54,15],[55,1,55,2],[55,4,55,7],[55,10,55,11],[55,12,55,13],[55,14,55,15],[56,1,56,2],[56,4,56,7],[56,10,56,11],[56,12,56,13],[56,14,56,15],[57,1,57,2],[57,4,57,7],[57,10,57,11],[57,12,57,13],[57,14,57,15],[58,1,58,2],[58,4,58,7],[58,10,58,11],[58,12,58,13],[58,14,58,15],[59,1,59,2],[59,4,59,7],[59,10,59,11],[59,12,59,13],[59,14,59,15],[60,1,60,2],[60,4,60,7],[60,10,60,11],[60,12,60,13],[60,14,60,15],[61,1,61,2],[61,4,61,7],[61,10,61,11],[61,12,61,13],[61,14,61,15],[62,1,62,2],[62,4,62,7],[62,10,62,11],[62,12,62,13],[62,14,62,15],[63,1,63,2],[63,4,63,7],[63,10,63,11],[63,12,63,13],[63,14,63,15],[64,1,64,2],[64,4,64,7],[64,10,64,11],[64,12,64,13],[64,14,64,15],[65,1,65,2],[65,4,65,7],[65,10,65,11],[65,12,65,13],[65,14,65,15],[66,1,66,2],[66,4,66,7],[66,10,66,11],[66,12,66,13],[66,14,66,15],[67,1,67,2],[67,4,67,7],[67,10,67,11],[67,12,67,13],[67,14,67,15],[68,1,68,2],[68,4,68,7],[68,10,68,11],[68,12,68,13],[68,14,68,15],[69,1,69,2],[69,4,69,7],[69,10,69,11],[69,12,69,13],[69,14,69,15],[70,1,70,2],[70,4,70,7],[70,10,70,11],[70,12,70,13],[70,14,70,15],[71,1,71,2],[71,4,71,7],[71,10,71,11],[71,12,71,13],[71,14,71,15],[72,1,72,2],[72,4,72,7],[72,10,72,11],[72,12,72,13],[72,14,72,15],[73,1,73,2],[73,4,73,7],[73,10,73,11],[73,12,73,13],[73,14,73,15],[74,1,74,2],[74,4,74,7],[74,10,74,11],[74,12,74,13],[74,14,74,15],[75,1,75,2],[75,4,75,7],[75,10,75,11],[75,12,75,13],[75,14,75,15],[76,1,76,2],[76,4,76,7],[76,10,76,11],[76,12,76,13],[76,14,76,15],[77,1,77,2],[77,4,77,7],[77,10,77,11],[77,12,77,13],[77,14,77,15],[78,1,78,2],[78,4,78,7],[78,10,78,11],[78,12,78,13],[78,14,78,15],[79,1,79,2],[79,4,79,7],[79,10,79,11],[79,12,79,13],[79,14,79,15],[80,1,80,2],[80,4,80,7],[80,10,80,11],[80,12,80,13],[80,14,80,15]]}
[null,null,null,null,"UNIDAD DE GESTION EDUCATIVA LOCAL PUNO UE 311"]
[null,null,null,null,"CUADRO DE NECESIDADES 2019",null,null,null,null,null,null,null,null,null,null,null,null,"CARV($E$4;CENTRO_COSTO!$C$2:$K$888;10;FALSO)"]
[]
["Codigo Centro de Costo",null,null,null,"1434.04.04",null,"Numero de Celular","980890282",null,null,"Nº  Personas",null,null,null,1]
[]
["Centro de Costos",null,null,null,{"$f":"+VLOOKUP($E$4,CENTRO_COSTO!$C$2:$D$888,2,FALSE)","v":"OFICINA DE CONTABILIDAD"},null,null,null,null,null,"Actividad de POI",null,null,null,null,null,null,{"$f":"IF(E4=\"\",\"\",VLOOKUP(E4,PERSONAL,9,FALSE))","v":906.99599999999998}]
[]
["Nombres y Apellidos ",null,null,null,{"$f":"IF(E4=\"\",\"\",VLOOKUP(E4,PERSONAL,4,FALSE))","v":"APAZAROJASJAVIER"},null,"Correo Electronico","1234@hotmail.com",null,null,"GESTION ADMINISTRATIVA",null,null,null,null,null,null,{"$f":"SUM(R11:R81)","v":32}]
[]
["CODIGO INTERNO","Clasificador de Gasto",null,"CATALOGO SIGA","DESCRIPCIÓN",null,null,null,"Unidad\nde medida","Precio Estimado","I DOTACION\nENE - ABR",null,"II DOTACION\nJUN - AGOT",null,"III DOTACION\nSET - DIC",null,"CANTIDAD","TOTAL","OBSERVACIONES"]
{"$rows_left_out":73}
{"sheet":"CN_2019_SERVICOS","index":1,"n_rows":82,"n_cols":23,"rows_kept":82,"cut":false,"hidden":true,"merged":[[77,1,77,2],[78,1,78,2],[79,1,79,2],[80,1,80,2],[73,1,73,2],[74,1,74,2],[75,1,75,2],[76,1,76,2],[64,1,64,2],[65,1,65,2],[66,1,66,2],[67,1,67,2],[68,1,68,2],[69,1,69,2],[70,1,70,2],[71,1,71,2],[72,1,72,2],[55,1,55,2],[56,1,56,2],[57,1,57,2],[58,1,58,2],[59,1,59,2],[60,1,60,2],[61,1,61,2],[62,1,62,2],[63,1,63,2],[46,1,46,2],[47,1,47,2],[48,1,48,2],[49,1,49,2],[50,1,50,2],[51,1,51,2],[52,1,52,2],[53,1,53,2],[54,1,54,2],[37,1,37,2],[38,1,38,2],[39,1,39,2],[40,1,40,2],[41,1,41,2],[42,1,42,2],[43,1,43,2],[44,1,44,2],[45,1,45,2],[29,1,29,2],[30,1,30,2],[31,1,31,2],[32,1,32,2],[33,1,33,2],[34,1,34,2],[35,1,35,2],[36,1,36,2],[22,1,22,2],[23,1,23,2],[24,1,24,2],[25,1,25,2],[26,1,26,2],[27,1,27,2],[28,1,28,2],[15,1,15,2],[16,1,16,2],[17,1,17,2],[18,1,18,2],[19,1,19,2],[20,1,20,2],[21,1,21,2],[5,0,5,2],[7,0,7,2],[9,1,9,2],[10,1,10,2],[11,1,11,2],[12,1,12,2],[13,1,13,2],[14,1,14,2],[79,4,79,7],[80,4,80,7],[77,4,77,7],[76,4,76,7],[14,4,14,7],[15,4,15,7],[16,4,16,7],[22,4,22,7],[18,4,18,7],[19,4,19,7],[20,4,20,7],[21,4,21,7],[17,4,17,7],[29,4,29,7],[30,4,30,7],[31,4,31,7],[23,4,23,7],[24,4,24,7],[25,4,25,7],[26,4,26,7],[27,4,27,7],[28,4,28,7],[36,4,36,7],[37,4,37,7],[7,7,7,8],[3,0,3,2],[1,21,1,22],[7,4,7,5],[6,0,6,4],[0,4,0,20],[1,4,1,20],[0,21,0,22],[3,10,3,13],[5,10,5,13],[4,0,4,3],[5,4,5,8],[3,7,3,8],[7,10,7,20],[9,4,9,7],[10,4,10,7],[11,4,11,7],[12,4,12,7],[13,4,13,7],[32,4,32,7],[33,4,33,7],[34,4,34,7],[35,4,35,7],[38,4,38,7],[39,4,39,7],[40,4,40,7],[57,4,57,7],[58,4,58,7],[41,4,41,7],[42,4,42,7],[43,4,43,7],[44,4,44,7],[45,4,45,7],[46,4,46,7],[47,4,47,7],[48,4,48,7],[49,4,49,7],[50,4,50,7],[51,4,51,7],[52,4,52,7],[53,4,53,7],[54,4,54,7],[55,4,55,7],[56,4,56,7],[59,4,59,7],[60,4,60,7],[61,4,61,7],[78,4,78,7],[67,4,67,7],[69,4,69,7],[70,4,70,7],[62,4,62,7],[63,4,63,7],[64,4,64,7],[65,4,65,7],[66,4,66,7],[68,4,68,7],[71,4,71,7],[72,4,72,7],[73,4,73,7],[74,4,74,7],[75,4,75,7]]}
[null,null,null,null,"UNIDAD DE GESTION EDUCATIVA LOCAL PUNO UE 311"]
[null,null,null,null,"CUADRO DE NECESIDADES 2019",null,null,null,null,null,null,null,null,null,null,null,null,null,null,null,null,"CARV($E$4;CENTRO_COSTO!$C$2:$K$888;10;FALSO)"]
[]
["Codigo Centro de Costo",null,null,null,"1434.04.10",null,"Numero de Celular","980890282",null,null,"Nº  Personas",null,null,null,1]
[]
["Centro de Costos",null,null,null,{"$f":"+VLOOKUP($E$4,CENTRO_COSTO!$C$2:$D$888,2,FALSE)","v":"ALMACEN"},null,null,null,null,null,"Actividad de POI",null,null,null,null,null,null,null,null,null,null,{"$f":"IF(E4=\"\",\"\",VLOOKUP(E4,PERSONAL,5,FALSE))","v":14675}]
[]
["Nombres y Apellidos ",null,null,null,{"$f":"IF(E4=\"\",\"\",VLOOKUP(E4,PERSONAL,4,FALSE))","v":"MAMANILUQUEMARWIN"},null,"Correo Electronico","ro2g2@hotmail.com",null,null,"Actividad Administrativa",null,null,null,null,null,null,null,null,null,null,{"$f":"SUM(V11:V81)","v":500}]
[]
["CODIGO INTERNO","Clasificador de Gasto",null,"CATALOGO SIGA","DESCRIPCIÓN",null,null,null,"Unidad\nde medida","01","02","03","04","05","06","07","08","09","10","11","12","TOTAL","OBSERVACIONES"]
{"$rows_left_out":73}
{"sheet":"CENTRO DE COSTOS","index":2,"n_rows":93,"n_cols":20,"rows_kept":93,"cut":false,"hidden":false,"merged":[]}
["CODIGO","NRO","NOMBRE DE ITEM","UNIDAD","PRECIO ESTIMADO","CLASIFICADOR",null,"TECHO ASIGNADO POR AREA, PARA ACTIVIDADES","TECHO ASIGNADO PARA ACTIVIDADES OPERATIVAS (Material de Escritorio)","TECHO ASIGNADO PARA ACTIVIDADES DE REACONDICIONAMIENTO DE INFRAESTRUCTURA","TECHO ASIGNADO PARA ACTIVIDADES, PARA ALAMACENES","TECHO ASIGNADO PARA ACTIVIDADES DE CAJA CHICA","TECHO ASIGNADO PARA ACTIVIDADES DE SERVICIOS BASICOS Y MENSAJERIA","TECHO ASIGNADO PARA EL MANTENIMIENTO DE VEHICULOS Y SOAT","TECHO ASIGNADO PARA LA CONTRATACION DE COMBUSTIBLE Y CARBURANTES","TECHO ASIGNADO PARA LA HABILITACION DE PASAJES Y VIATICOS","TECHO ASIGNADO PARA MANTENIMIENTO DE EQUIPOS","TECHO ASIGNADO PARA ASEO Y TOCADOR","TECHO ASIGNADO PARA CONTRATACION POR TERCEROS","TECHO ASIGNADO PARA RECERVA DE CONTINGENCIA"]
[null,null,"GOBIERNO REGIONAL DE PUNO - UGEL PUNO","CORNEJO MAMANI DAVID GREGORIO"]
[null,null,"DIRECCIÓN GENRAL UGEL PUNO","CORNEJO MAMANI DAVID GREGORIO",null,"2.3. 1 5. 3 1",null,42500,0]
["1434.01.01",1,"DIRECCION GENERAL","CORNEJO MAMANI DAVID GREGORIO",31962,"2.3. 1 5. 3 1",null,null,889.19999999999993]
["1434.01.02",2,"SECRETARIA DIRECCIÓN","FLORES CANO YUSEY DEL PILAR YASMIN",136,"2.3. 1 5. 3 1",null,null,1134.252,null,null,{"$f":"1500*12","v":18000}]
["1434.01.03",3,"TRAMITE DOCUMENTARIO","FORAQUITAGUZMANJUANA SONIA ROXANA",2959,"2.3. 1 5. 3 1",null,null,889.23599999999999,null,null,null,1000]
["1434.01.04",4,"IMAGEN INSTITUCIONAL","GORDILLOHERMOSACARLOS",11529,null,null,null,677.73599999999999]
["1434.01.05",5,"ACTAS Y CERTIFICADOS","TURPOVILCASIMON",302,null,null,null,677.73599999999999]
["1434.01.06",6,"SECRETARIO TECNICO COPROA","TACCAPUMACAJIAEFRAIN",1593,null,null,null,677.73599999999999]
[null,null,"ÁREA DE ASESORIA JURIDICA","CRUZMAMANIFLAVIO",null,null,null,11000,0]
{"$rows_left_out":84}
{"sheet":"CATALOGO","index":3,"n_rows":580,"n_cols":6,"rows_kept":580,"cut":false,"hidden":false,"merged":[]}
["N°","CODIGO","NOMBRE DE ITEM","UNIDAD","PRECIO ESTIMADO","CLASIFICADOR"]
[1,"133000410156","ALCOHOL SPRAY X 400 mL","UNIDAD",12]
[2,"133000140205","AMBIENTADOR EN PASTILLA PARA BAÑO X 40 gr APROX.","UNIDAD",7,"2.3. 1 5. 3 1"]
[3,"133000140079","AMBIENTADOR EN SPRAY X 360 mL","UNIDAD",7,"2.3. 1 5. 3 1"]
[4,"133000140077","AMBIENTADOR EN SPRAY X 400 mL APROX.","UNIDAD",7,"2.3. 1 5. 3 1"]
[5,"133000140091","AMBIENTADOR EN SPRAY X 650 mL","UNIDAD",7,"2.3. 1 5. 3 1"]
[6,"710600010009","ARCHIVADOR DE CARTON CON PALANCA LOMO ANCHO TAMAÑO MEDIO OFICIO","UNIDAD",4,"2.3. 1 5. 3 1"]
[7,"710600010012","ARCHIVADOR DE CARTON CON PALANCA LOMO ANCHO TAMAÑO OFICIO","UNIDAD",3.66,"2.3. 1 5. 3 1"]
[8,"710600010014","ARCHIVADOR DE CARTON CON PALANCA LOMO ANGOSTO TAMAÑO MEDIO OFICIO","UNIDAD",4,"2.3. 1 5. 3 1"]
[9,"283400060097","BATERIA 13 PLACAS 12 V 75 A","UNIDAD",335,"2.3. 1 5. 3 1"]
{"$rows_left_out":571}
{"sheet":"CENTRO_COSTO","index":4,"n_rows":83,"n_cols":10,"rows_kept":83,"cut":false,"hidden":true,"merged":[]}
["N°","Distrito","Cód. Mod.","Nombre de IE","RESPONSABLE","TECHO-PPTO","Tipo IE","Total  de estudiantes matriculados (*)",null,"area"]
[null,"Mañazo","311-1434","GOBIERNO REGIONAL DE PUNO - UGEL PUNO","CORNEJOMAMANIDAVID GREGORIO",null,null,null,{"$f":"+B2","v":"Mañazo"}]
[null,"Puno","1434.01","DIRECCIÓN GENRAL UGEL PUNO","CORNEJOMAMANIDAVID GREGORIO",null,null,null,"Puno"]
[1,"Puno","1434.01.01","DIRECCION GENERAL","CORNEJOMAMANIDAVID GREGORIO",null,null,null,"Puno"]
[2,"Puno","1434.01.02","SECRETARIA DIRECCIÓN","FLORESCANOYUSEY DEL PILAR YASMIN",null,null,null,"Puno"]
[3,"Puno","1434.01.03","TRAMITE DOCUMENTARIO","FORAQUITAGUZMANJUANA SONIA ROXANA",null,null,null,"Puno"]
[4,"Puno","1434.01.04","IMAGEN INSTITUCIONAL","GORDILLOHERMOSACARLOS",null,null,null,"Puno"]
[5,"Puno","1434.01.05","ACTAS Y CERTIFICADOS","TURPOVILCASIMON",null,null,null,"Puno"]
[6,"Puno","1434.01.06","SECRETARIO TECNICO COPROA","TACCAPUMACAJIAEFRAIN",null,null,null,"Puno"]
[null,"Puno","1434.02","ÁREA DE ASESORIA JURIDICA","CRUZMAMANIFLAVIO",null,null,null,"Puno"]
{"$rows_left_out":74}
{"sheet":"ACTIVIDAD POI 2019","index":5,"n_rows":44,"n_cols":3,"rows_kept":44,"cut":false,"hidden":false,"merged":[]}
[]
["C004"," TALLER DE ACTUALIZACIÓN CON EL MINEDU-AGI- UGEL PUNO.",2.2999999999999998]
["C0005","FORTALECIMIENTO DE CAPACIDADES A DIRECTORES DE IE EN INSTRUMENTOS DE GESTION Y PROCESO DE RACIONALIZACION",2.2999999999999998]
["C0006","FORTALECIMIENTO DE CAPACIDADES A SERVIDORES DE LA UGEL",2.2999999999999998]
["C0007","MONITOREO Y ASISTENCIA A IIEE EN MANTENIMIENTO DE LOCALES ESCOLARES E INSTRUMENTOS DE GESTION",2.2999999999999998]
["C0008","ACTUALIZACION DEL PEL MEDIANTE EL COPALE",2.2999999999999998]
["C0009","SANEAMIENTO FISICO LEGAL DE PREDIOS ESCOLARES",2.2999999999999998]
["C0010"," EMISION DE LOS PROGRAMAS AGENDA EDUCATIVA EN RADIO Y TELEVISION 2018",2.2999999999999998]
["C0011","CEREMONIA DE RECONOCIMIENTO POR EL DIA DEL MAESTRO 2018",2.2999999999999998]
["C0012"," ELABORACION DE LA REVISTA INSTITUCIONAL",2.2999999999999998]
{"$rows_left_out":35}
{"sheet":"INSTRUCTIVO","index":6,"n_rows":82,"n_cols":19,"rows_kept":82,"cut":false,"hidden":false,"merged":[[79,1,79,2],[79,4,79,7],[79,10,79,11],[79,12,79,13],[79,14,79,15],[80,1,80,2],[80,4,80,7],[80,10,80,11],[80,12,80,13],[80,14,80,15],[77,1,77,2],[77,4,77,7],[77,10,77,11],[77,12,77,13],[77,14,77,15],[78,1,78,2],[78,4,78,7],[78,10,78,11],[78,12,78,13],[78,14,78,15],[75,1,75,2],[75,4,75,7],[75,10,75,11],[75,12,75,13],[75,14,75,15],[76,1,76,2],[76,4,76,7],[76,10,76,11],[76,12,76,13],[76,14,76,15],[73,1,73,2],[73,4,73,7],[73,10,73,11],[73,12,73,13],[73,14,73,15],[74,1,74,2],[74,4,74,7],[74,10,74,11],[74,12,74,13],[74,14,74,15],[71,1,71,2],[71,4,71,7],[71,10,71,11],[71,12,71,13],[71,14,71,15],[72,1,72,2],[72,4,72,7],[72,10,72,11],[72,12,72,13],[72,14,72,15],[69,1,69,2],[69,4,69,7],[69,10,69,11],[69,12,69,13],[69,14,69,15],[70,1,70,2],[70,4,70,7],[70,10,70,11],[70,12,70,13],[70,14,70,15],[67,1,67,2],[67,4,67,7],[67,10,67,11],[67,12,67,13],[67,14,67,15],[68,1,68,2],[68,4,68,7],[68,10,68,11],[68,12,68,13],[68,14,68,15],[65,1,65,2],[65,4,65,7],[65,10,65,11],[65,12,65,13],[65,14,65,15],[66,1,66,2],[66,4,66,7],[66,10,66,11],[66,12,66,13],[66,14,66,15],[63,1,63,2],[63,4,63,7],[63,10,63,11],[63,12,63,13],[63,14,63,15],[64,1,64,2],[64,4,64,7],[64,10,64,11],[64,12,64,13],[64,14,64,15],[61,1,61,2],[61,4,61,7],[61,10,61,11],[61,12,61,13],[61,14,61,15],[62,1,62,2],[62,4,62,7],[62,10,62,11],[62,12,62,13],[62,14,62,15],[59,1,59,2],[59,4,59,7],[59,10,59,11],[59,12,59,13],[59,14,59,15],[60,1,60,2],[60,4,60,7],[60,10,60,11],[60,12,60,13],[60,14,60,15],[57,1,57,2],[57,4,57,7],[57,10,57,11],[57,12,57,13],[57,14,57,15],[58,1,58,2],[58,4,58,7],[58,10,58,11],[58,12,58,13],[58,14,58,15],[55,1,55,2],[55,4,55,7],[55,10,55,11],[55,12,55,13],[55,14,55,15],[56,1,56,2],[56,4,56,7],[56,10,56,11],[56,12,56,13],[56,14,56,15],[53,1,53,2],[53,4,53,7],[53,10,53,11],[53,12,53,13],[53,14,53,15],[54,1,54,2],[54,4,54,7],[54,10,54,11],[54,12,54,13],[54,14,54,15],[51,1,51,2],[51,4,51,7],[51,10,51,11],[51,12,51,13],[51,14,51,15],[52,1,52,2],[52,4,52,7],[52,10,52,11],[52,12,52,13],[52,14,52,15],[49,1,49,2],[49,4,49,7],[49,10,49,11],[49,12,49,13],[49,14,49,15],[50,1,50,2],[50,4,50,7],[50,10,50,11],[50,12,50,13],[50,14,50,15],[47,1,47,2],[47,4,47,7],[47,10,47,11],[47,12,47,13],[47,14,47,15],[48,1,48,2],[48,4,48,7],[48,10,48,11],[48,12,48,13],[48,14,48,15],[45,1,45,2],[45,4,45,7],[45,10,45,11],[45,12,45,13],[45,14,45,15],[46,1,46,2],[46,4,46,7],[46,10,46,11],[46,12,46,13],[46,14,46,15],[43,1,43,2],[43,4,43,7],[43,10,43,11],[43,12,43,13],[43,14,43,15],[44,1,44,2],[44,4,44,7],[44,10,44,11],[44,12,44,13],[44,14,44,15],[41,1,41,2],[41,4,41,7],[41,10,41,11],[41,12,41,13],[41,14,41,15],[42,1,42,2],[42,4,42,7],[42,10,42,11],[42,12,42,13],[42,14,42,15],[39,1,39,2],[39,4,39,7],[39,10,39,11],[39,12,39,13],[39,14,39,15],[40,1,40,2],[40,4,40,7],[40,10,40,11],[40,12,40,13],[40,14,40,15],[37,1,37,2],[37,4,37,7],[37,10,37,11],[37,12,37,13],[37,14,37,15],[38,1,38,2],[38,4,38,7],[38,10,38,11],[38,12,38,13],[38,14,38,15],[35,1,35,2],[35,4,35,7],[35,10,35,11],[35,12,35,13],[35,14,35,15],[36,1,36,2],[36,4,36,7],[36,10,36,11],[36,12,36,13],[36,14,36,15],[33,1,33,2],[33,4,33,7],[33,10,33,11],[33,12,33,13],[33,14,33,15],[34,1,34,2],[34,4,34,7],[34,10,34,11],[34,12,34,13],[34,14,34,15],[31,1,31,2],[31,4,31,7],[31,10,31,11],[31,12,31,13],[31,14,31,15],[32,1,32,2],[32,4,32,7],[32,10,32,11],[32,12,32,13],[32,14,32,15],[29,1,29,2],[29,4,29,7],[29,10,29,11],[29,12,29,13],[29,14,29,15],[30,1,30,2],[30,4,30,7],[30,10,30,11],[30,12,30,13],[30,14,30,15],[27,1,27,2],[27,4,27,7],[27,10,27,11],[27,12,27,13],[27,14,27,15],[28,1,28,2],[28,4,28,7],[28,10,28,11],[28,12,28,13],[28,14,28,15],[25,1,25,2],[25,4,25,7],[25,10,25,11],[25,12,25,13],[25,14,25,15],[26,1,26,2],[26,4,26,7],[26,10,26,11],[26,12,26,13],[26,14,26,15],[23,1,23,2],[23,4,23,7],[23,10,23,11],[23,12,23,13],[23,14,23,15],[24,1,24,2],[24,4,24,7],[24,10,24,11],[24,12,24,13],[24,14,24,15],[21,1,21,2],[21,4,21,7],[21,10,21,11],[21,12,21,13],[21,14,21,15],[22,1,22,2],[22,4,22,7],[22,10,22,11],[22,12,22,13],[22,14,22,15],[19,1,19,2],[19,4,19,7],[19,10,19,11],[19,12,19,13],[19,14,19,15],[20,1,20,2],[20,4,20,7],[20,10,20,11],[20,12,20,13],[20,14,20,15],[17,1,17,2],[17,4,17,7],[17,10,17,11],[17,12,17,13],[17,14,17,15],[18,1,18,2],[18,4,18,7],[18,10,18,11],[18,12,18,13],[18,14,18,15],[15,1,15,2],[15,4,15,7],[15,10,15,11],[15,12,15,13],[15,14,15,15],[16,1,16,2],[16,4,16,7],[16,10,16,11],[16,12,16,13],[16,14,16,15],[13,1,13,2],[13,4,13,7],[13,10,13,11],[13,12,13,13],[13,14,13,15],[14,1,14,2],[14,4,14,7],[14,10,14,11],[14,12,14,13],[14,14,14,15],[11,1,11,2],[11,4,11,7],[11,10,11,11],[11,12,11,13],[11,14,11,15],[12,1,12,2],[12,4,12,7],[12,10,12,11],[12,12,12,13],[12,14,12,15],[9,1,9,2],[9,4,9,7],[9,10,9,11],[9,12,9,13],[9,14,9,15],[10,1,10,2],[10,4,10,7],[10,10,10,11],[10,12,10,13],[10,14,10,15],[0,4,0,14],[0,15,0,16],[0,17,0,18],[1,4,1,14],[1,15,1,16],[1,17,1,18],[6,0,6,4],[6,16,6,17],[7,0,7,2],[7,4,7,5],[7,7,7,8],[3,0,3,2],[3,7,3,8],[3,10,3,13],[3,14,3,15],[4,0,4,3],[5,0,5,2],[5,4,5,8],[5,10,5,13],[5,14,5,15],[7,10,7,15]]}
[null,null,null,null,"UNIDAD DE GESTION EDUCATIVA LOCAL PUNO UE 311"]
[null,null,null,null,"CUADRO DE NECESIDADES 2019",null,null,null,null,null,null,null,null,null,null,null,null,"CARV($E$4;CENTRO_COSTO!$C$2:$K$888;10;FALSO)"]
[]
["Codigo Centro de Costo",null,null,null,"1434.04.03",null,"Numero de Celular","980890282",null,null,"Nº  Personas",null,null,null,5]
[]
["Centro de Costos",null,null,null,{"$f":"+VLOOKUP($E$4,CENTRO_COSTO!$C$2:$D$888,2,FALSE)","v":"OFICINA DE ABASTECIMIENTOS"},null,null,null,null,null,"Actividad de POI",null,null,null,null,null,null,{"$f":"IF(E4=\"\",\"\",VLOOKUP(E4,PERSONAL,5,FALSE))","v":38222}]
[]
["Nombres y Apellidos ",null,null,null,{"$f":"IF(E4=\"\",\"\",VLOOKUP(E4,PERSONAL,4,FALSE))","v":"QUISPEFRISANCHOELAR PABLO"},null,"Correo Electronico","ro2g2@hotmail.com",null,null,"Actividad Administrativa",null,null,null,null,null," - Aprobado",{"$f":"SUM(R11:R81)","v":360}]
[]
["CODIGO INTERNO","Clasificador de Gasto",null,"CATALOGO SIGA","DESCRIPCIÓN",null,null,null,"Unidad\nde medida","Precio Estimado","I DOTACION\nENE - ABR",null,"II DOTACION\nJUN - AGOT",null,"III DOTACION\nSET - DIC",null,"CANTIDAD","TOTAL","OBSERVACIONES"]
{"$rows_left_out":72}