{"text_format":"1","workbook":"xlsx","n_sheets":5,"sheets":["CUADRO DE NECESIDADES","Hoja2","INSTRUCTIVO PARA LLENAR","CATALOGO","LISTADO IIEE"],"not_rendered":{"charts":0,"images":4,"macros":1,"external_links":1,"defined_names":14,"comments":0,"pivot_tables":0},"unopened":[],"bounds":{"document_bytes":16777216,"sheet_cells":100000,"rows_first":2000,"rows_last":500,"rows_between":2000,"halvings":0,"cell_chars":16384,"cell_head_chars":4096},"cells_cut":0,"cells_raw":0,"read":"whole","date_system":"1900"}

{"sheet":"CUADRO DE NECESIDADES","index":0,"n_rows":82,"n_cols":19,"rows_kept":82,"cut":false,"hidden":false,"merged":[[77,1,77,2],[78,1,78,2],[79,1,79,2],[80,1,80,2],[73,1,73,2],[74,1,74,2],[75,1,75,2],[76,1,76,2],[64,1,64,2],[65,1,65,2],[66,1,66,2],[67,1,67,2],[68,1,68,2],[69,1,69,2],[70,1,70,2],[71,1,71,2],[72,1,72,2],[55,1,55,2],[56,1,56,2],[57,1,57,2],[58,1,58,2],[59,1,59,2],[60,1,60,2],[61,1,61,2],[62,1,62,2],[63,1,63,2],[46,1,46,2],[47,1,47,2],[48,1,48,2],[49,1,49,2],[50,1,50,2],[51,1,51,2],[52,1,52,2],[53,1,53,2],[54,1,54,2],[37,1,37,2],[38,1,38,2],[39,1,39,2],[40,1,40,2],[41,1,41,2],[42,1,42,2],[43,1,43,2],[44,1,44,2],[45,1,45,2],[29,1,29,2],[30,1,30,2],[31,1,31,2],[32,1,32,2],[33,1,33,2],[34,1,34,2],[35,1,35,2],[36,1,36,2],[22,1,22,2],[23,1,23,2],[24,1,24,2],[25,1,25,2],[26,1,26,2],[27,1,27,2],[28,1,28,2],[15,1,15,2],[16,1,16,2],[17,1,17,2],[18,1,18,2],[19,1,19,2],[20,1,20,2],[21,1,21,2],[5,0,5,2],[7,0,7,2],[9,1,9,2],[10,1,10,2],[11,1,11,2],[12,1,12,2],[13,1,13,2],[14,1,14,2],[79,12,79,13],[80,12,80,13],[77,10,77,11],[77,12,77,13],[78,10,78,11],[78,12,78,13],[79,10,79,11],[80,10,80,11],[76,10,76,11],[76,12,76,13],[71,10,71,11],[71,12,71,13],[72,10,72,11],[72,12,72,13],[73,10,73,11],[73,12,73,13],[74,10,74,11],[74,12,74,13],[75,10,75,11],[75,12,75,13],[66,10,66,11],[66,12,66,13],[67,10,67,11],[67,12,67,13],[68,10,68,11],[68,12,68,13],[69,10,69,11],[69,12,69,13],[70,10,70,11],[70,12,70,13],[61,10,61,11],[61,12,61,13],[62,10,62,11],[62,12,62,13],[63,10,63,11],[63,12,63,13],[64,10,64,11],[64,12,64,13],[65,10,65,11],[65,12,65,13],[56,10,56,11],[57,10,57,11],[58,10,58,11],[59,10,59,11],[56,12,56,13],[57,12,57,13],[58,12,58,13],[59,12,59,13],[60,10,60,11],[60,12,60,13],[47,12,47,13],[48,12,48,13],[49,12,49,13],[50,12,50,13],[51,12,51,13],[52,12,52,13],[53,12,53,13],[54,12,54,13],[55,12,55,13],[47,10,47,11],[48,10,48,11],[49,10,49,11],[50,10,50,11],[51,10,51,11],[52,10,52,11],[53,10,53,11],[54,10,54,11],[55,10,55,11],[37,12,37,13],[38,12,38,13],[39,12,39,13],[40,10,40,11],[41,10,41,11],[42,10,42,11],[43,10,43,11],[44,10,44,11],[46,10,46,11],[40,12,40,13],[41,12,41,13],[42,12,42,13],[43,12,43,13],[44,12,44,13],[45,12,45,13],[46,12,46,13],[32,10,32,11],[34,10,34,11],[35,10,35,11],[36,10,36,11],[37,10,37,11],[38,10,38,11],[39,10,39,11],[16,12,16,13],[17,10,17,11],[17,12,17,13],[18,10,18,11],[18,12,18,13],[19,10,19,11],[19,12,19,13],[20,10,20,11],[20,12,20,13],[29,12,29,13],[30,12,30,13],[31,12,31,13],[32,12,32,13],[33,12,33,13],[34,12,34,13],[35,12,35,13],[36,12,36,13],[79,4,79,7],[80,4,80,7],[77,4,77,7],[76,4,76,7],[14,12,14,13],[15,10,15,11],[15,12,15,13],[16,10,16,11],[14,4,14,7],[15,4,15,7],[16,4,16,7],[14,10,14,11],[22,4,22,7],[18,4,18,7],[19,4,19,7],[20,4,20,7],[21,4,21,7],[21,10,21,11],[17,4,17,7],[21,12,21,13],[22,10,22,11],[22,12,22,13],[29,4,29,7],[30,4,30,7],[6,14,6,15],[6,0,6,4],[0,4,0,12],[1,4,1,12],[0,15,0,17],[0,13,0,14],[7,10,7,11],[3,12,3,13],[5,12,5,13],[7,12,7,13],[3,10,3,11],[5,10,5,11],[4,0,4,3],[5,4,5,8],[3,7,3,8],[7,7,7,8],[3,0,3,2],[1,13,1,14],[1,15,1,17],[9,12,9,13],[10,10,10,11],[10,12,10,13],[11,12,11,13],[12,10,12,11],[12,12,12,13],[13,10,13,11],[13,12,13,13],[9,4,9,7],[10,4,10,7],[11,4,11,7],[12,4,12,7],[13,4,13,7],[9,10,9,11],[11,10,11,11],[23,12,23,13],[24,12,24,13],[25,12,25,13],[26,12,26,13],[27,12,27,13],[28,12,28,13],[31,4,31,7],[23,10,23,11],[24,10,24,11],[25,10,25,11],[26,10,26,11],[27,10,27,11],[28,10,28,11],[29,10,29,11],[30,10,30,11],[31,10,31,11],[23,4,23,7],[24,4,24,7],[25,4,25,7],[26,4,26,7],[27,4,27,7],[28,4,28,7],[32,4,32,7],[33,4,33,7],[34,4,34,7],[35,4,35,7],[36,4,36,7],[37,4,37,7],[38,4,38,7],[39,4,39,7],[40,4,40,7],[57,4,57,7],[58,4,58,7],[41,4,41,7],[42,4,42,7],[43,4,43,7],[44,4,44,7],[45,4,45,7],[46,4,46,7],[47,4,47,7],[48,4,48,7],[49,4,49,7],[50,4,50,7],[51,4,51,7],[52,4,52,7],[33,10,33,11],[45,10,45,11],[59,4,59,7],[60,4,60,7],[61,4,61,7],[78,4,78,7],[67,4,67,7],[69,4,69,7],[70,4,70,7],[62,4,62,7],[63,4,63,7],[64,4,64,7],[65,4,65,7],[66,4,66,7],[68,4,68,7],[71,4,71,7],[72,4,72,7],[73,4,73,7],[74,4,74,7],[75,4,75,7],[53,4,53,7],[54,4,54,7],[55,4,55,7],[56,4,56,7]]}
[null,null,null,null,"         UNIDAD DE GESTION EDUCATIVA LOCAL PUNO UE 311",null,null,null,null,null,null,null,null,"DISTRITO",null,{"$f":"+VLOOKUP($E$4,'LISTADO IIEE'!D2:K2572,7,FALSE)","v":"ACORA"}]
[null,null,null,null,"CUADRO DE NECESIDADES 2019",null,null,null,null,null,null,null,null,"N°",null,{"$f":"+VLOOKUP($E$4,'LISTADO IIEE'!$D$2:$M$888,10,FALSE)","v":13}]
[null,null,null,null,null,null,null,null,null,null,null,null,null,null,null,{"$f":"SUM(P11:P81)","v":0},{"$f":"+VLOOKUP($E$4,'LISTADO IIEE'!$D$2:$K$888,8,FALSE)","v":"Rural"},{"$f":"SUM(P13:P81)","v":0}]
["Codigo Modular del Centro de Costo",null,null,null,"2060613",null,"Numero de Celular",null,null,null,"Nº de Alum. Matriculados",null,{"$f":"+VLOOKUP(E4,'LISTADO IIEE'!D2:I2417,6,FALSE)","v":8}]
[]
["Institucion Educativa",null,null,null,{"$f":"+VLOOKUP($E$4,'LISTADO IIEE'!$D$2:$E$888,2,FALSE)","v":"CENTRAL PUKARA"},null,null,null,null,null,"Nº Docentes",null,0,null,null,192]
[]
["Nombres y Apellidos del Director",null,null,null,null,null,"Correo Electronico",null,null,null,"Nº de Aulas",null,0,null,"Aprobado",0," - Aprobado",{"$f":"+Q8","v":" - Aprobado"}]
[]
["CODIGO INTERNO","Clasificador de Gasto",null,"CATALOGO SIGA","DESCRIPCIÓN",null,null,null,"Unidad\nde medida","Precio Estimado","I DOTACION\nENERO - JUNIO",null,"II DOTACION\nJULIO - DICIEMBRE",null,"CANTIDAD","TOTAL","C.M","OBSERVACIONES","CLASIFICADOR"]
[null,null,null,{"$f":"IF(A11=\"\",\"\",VLOOKUP(A11,CATALOGO,2,FALSE))","v":""},{"$f":"IF(A11=\"\",\"\",VLOOKUP(A11,CATALOGO,3,FALSE))","v":""},null,null,null,{"$f":"IF(A11=\"\",\"\",VLOOKUP(A11,CATALOGO,4,FALSE))","v":""},{"$f":"IF(D11=\"\",\"\",VLOOKUP(D11,CATALOGO!$B$2:$E$349,4,FALSE))","v":""},null,null,null,null,{"$f":"IF(A11=\"\",\"\",(L11+M11+N11+K11))","v":""},{"$f":"IF(J11=\"\",\"\",(J11*O11))","v":""},{"$f":"+E$4","v":"2060613"},null,{"$f":"IF(A11=\"\",\"\",VLOOKUP(A11,CATALOGO,6,FALSE))","v":""}]
[null,null,null,"",{"$f":"IF(A12=\"\",\"\",VLOOKUP(A12,CATALOGO,3,FALSE))","v":""},null,null,null,{"$f":"IF(A12=\"\",\"\",VLOOKUP(A12,CATALOGO,4,FALSE))","v":""},{"$f":"IF(D12=\"\",\"\",VLOOKUP(D12,CATALOGO!$B$2:$E$349,4,FALSE))","v":""},null,null,null,null,"","",{"$f":"+E$4","v":"2060613"},null,""]
[null,null,null,"","",null,null,null,"",{"$f":"IF(D13=\"\",\"\",VLOOKUP(D13,CATALOGO!$B$2:$E$349,4,FALSE))","v":""},null,null,null,null,"","","2060613",null,""]
[null,null,null,"","",null,null,null,"",{"$f":"IF(D14=\"\",\"\",VLOOKUP(D14,CATALOGO!$B$2:$E$349,4,FALSE))","v":""},null,null,null,null,"","","2060613",null,""]
[null,null,null,"","",null,null,null,"",{"$f":"IF(D15=\"\",\"\",VLOOKUP(D15,CATALOGO!$B$2:$E$349,4,FALSE))","v":""},null,null,null,null,"","","2060613",null,""]
[null,null,null,"","",null,null,null,"",{"$f":"IF(D16=\"\",\"\",VLOOKUP(D16,CATALOGO!$B$2:$E$349,4,FALSE))","v":""},null,null,null,null,"","","2060613",null,""]
[null,null,null,"","",null,null,null,"",{"$f":"IF(D17=\"\",\"\",VLOOKUP(D17,CATALOGO!$B$2:$E$349,4,FALSE))","v":""},null,null,null,null,"","","2060613",null,""]
[null,null,null,"","",null,null,null,"",{"$f":"IF(D18=\"\",\"\",VLOOKUP(D18,CATALOGO!$B$2:$E$349,4,FALSE))","v":""},null,null,null,null,"","","2060613",null,""]
[null,null,null,"","",null,null,null,"",{"$f":"IF(D19=\"\",\"\",VLOOKUP(D19,CATALOGO!$B$2:$E$349,4,FALSE))","v":""},null,null,null,null,"","","2060613",null,""]
[null,null,null,"","",null,null,null,"",{"$f":"IF(D20=\"\",\"\",VLOOKUP(D20,CATALOGO!$B$2:$E$349,4,FALSE))","v":""},null,null,null,null,"","","2060613",null,""]
[null,null,null,"","",null,null,null,"",{"$f":"IF(D21=\"\",\"\",VLOOKUP(D21,CATALOGO!$B$2:$E$349,4,FALSE))","v":""},null,null,null,null,"","","2060613",null,""]
[null,null,null,"","",null,null,null,"",{"$f":"IF(D22=\"\",\"\",VLOOKUP(D22,CATALOGO!$B$2:$E$349,4,FALSE))","v":""},null,null,null,null,"","","2060613",null,""]
[null,null,null,"","",null,null,null,"",{"$f":"IF(D23=\"\",\"\",VLOOKUP(D23,CATALOGO!$B$2:$E$349,4,FALSE))","v":""},null,null,null,null,"","","2060613",null,""]
[null,null,null,"","",null,null,null,"",{"$f":"IF(D24=\"\",\"\",VLOOKUP(D24,CATALOGO!$B$2:$E$349,4,FALSE))","v":""},null,null,null,null,"","","2060613",null,""]
[null,null,null,"","",null,null,null,"",{"$f":"IF(D25=\"\",\"\",VLOOKUP(D25,CATALOGO!$B$2:$E$349,4,FALSE))","v":""},null,null,null,null,"","","2060613",null,""]
[null,null,null,"","",null,null,null,"",{"$f":"IF(D26=\"\",\"\",VLOOKUP(D26,CATALOGO!$B$2:$E$349,4,FALSE))","v":""},null,null,null,null,"","","2060613",null,""]
[null,null,null,"","",null,null,null,"",{"$f":"IF(D27=\"\",\"\",VLOOKUP(D27,CATALOGO!$B$2:$E$349,4,FALSE))","v":""},null,null,null,null,"","","2060613",null,""]
[null,null,null,"","",null,null,null,"",{"$f":"IF(D28=\"\",\"\",VLOOKUP(D28,CATALOGO!$B$2:$E$349,4,FALSE))","v":""},null,null,null,null,"","","2060613",null,""]
[null,null,null,"","",null,null,null,"",{"$f":"IF(D29=\"\",\"\",VLOOKUP(D29,CATALOGO!$B$2:$E$349,4,FALSE))","v":""},null,null,null,null,"","","2060613",null,""]
[null,null,null,"","",null,null,null,"",{"$f":"IF(D30=\"\",\"\",VLOOKUP(D30,CATALOGO!$B$2:$E$349,4,FALSE))","v":""},null,null,null,null,"","","2060613",null,""]
{"$rows_left_out":53}
{"sheet":"Hoja2","index":1,"n_rows":15,"n_cols":3,"rows_kept":15,"cut":false,"hidden":true,"merged":[]}
["1. PUNO."]
["2. ACORA.",null,5]
["3. AMANTANI."]
["4. ATUNCOLLA."]
["5. CAPACHICA."]
["6. CHUCUITO."]
["7. COATA."]
["8. HUATA."]
["9. MAÑAZO."]
["10. PAUCARCOLLA."]
["11. PICHACANI (Laraqueri)."]
["12. PLATERIA."]
["13. SAN ANTONIO (San Antonio de Esquilache)."]
["14. TIQUILLACA."]
["15. VILQUE."]

{"sheet":"INSTRUCTIVO PARA LLENAR","index":2,"n_rows":79,"n_cols":12,"rows_kept":79,"cut":false,"hidden":false,"merged":[[1,9,1,10],[2,3,2,6],[7,8,7,9],[4,6,4,7],[4,1,4,2],[4,3,4,4],[8,1,8,2],[8,3,8,4],[1,3,1,6],[8,6,8,7],[5,1,5,2],[6,1,6,2],[6,6,6,7],[7,1,7,3],[1,7,1,8]]}
[]
[null,null,null,"UNIDAD DE GESTION EDUCATIVA PUNO",null,null,null,"DISTRITO",null,"ATUNCOLLA"]
[null,null,null,"CUADRO DE NECESIDADES 2018"]
[]
[null,"Centro de Costo \nInstitucion Educativa",null,70000,null,null,120]
[null,null,null,null,null,null,null,null,0]
[null,"Codigo Modular",null,70020041,null,null,3,null,null,123]
[]
[null,"Nombres y Apellidos DIRECTOR(e)(a)",null,"JUAN PEREZ PEREZ",null,null,4,null,null,{"$f":"SUM(J12:J81)","v":{"$error":"#REF!"}}]
[]
[null,"CODIGO INTERNO","CATALOGO SIGA","DESCRIPCIÓN","Unidad\nde medida","Precio Estimado","I DOTACION","II DOTACION","CANTIDAD","TOTAL","OBSERVACIONES","CLASIFICADOR"]
[null,1,{"$f":"IF(B12=\"\",\"\",VLOOKUP(B12,CATALOGO,2,FALSE))","v":"133000140205"},{"$f":"IF(B12=\"\",\"\",VLOOKUP(B12,CATALOGO,3,FALSE))","v":"AMBIENTADOR EN PASTILLA PARA BAÑO X 40 gr APROX."},{"$f":"IF(B12=\"\",\"\",VLOOKUP(B12,CATALOGO,4,FALSE))","v":"UNIDAD"},{"$f":"IF(B12=\"\",\"\",VLOOKUP(B12,CATALOGO,5,FALSE))","v":7},null,null,{"$f":"IF(B12=\"\",\"\",(#REF!+G12+H12+#REF!))","v":{"$error":"#REF!"}},{"$f":"IF(F12=\"\",\"\",(F12*I12))","v":{"$error":"#REF!"}},null,{"$f":"IF(B12=\"\",\"\",VLOOKUP(B12,CATALOGO,6,FALSE))","v":0}]
[null,2,"133000140079","AMBIENTADOR EN SPRAY X 360 mL","UNIDAD",7,null,null,{"$f":"IF(B13=\"\",\"\",(#REF!+G13+H13+#REF!))","v":{"$error":"#REF!"}},{"$error":"#REF!"}]
[null,3,"133000140077","AMBIENTADOR EN SPRAY X 400 mL APROX.","UNIDAD",7,null,null,{"$f":"IF(B14=\"\",\"\",(#REF!+G14+H14+#REF!))","v":{"$error":"#REF!"}},{"$error":"#REF!"}]
[null,4,"133000140091","AMBIENTADOR EN SPRAY X 650 mL","UNIDAD",7,null,null,{"$f":"IF(B15=\"\",\"\",(#REF!+G15+H15+#REF!))","v":{"$error":"#REF!"}},{"$error":"#REF!"}]
[null,5,"646100080005","ANTISARRO PARA WATER","UNIDAD",3.2,null,null,{"$f":"IF(B16=\"\",\"\",(#REF!+G16+H16+#REF!))","v":{"$error":"#REF!"}},{"$error":"#REF!"}]
[null,6,"710600010012","ARCHIVADOR DE CARTON CON PALANCA LOMO ANCHO TAMAÑO OFICIO","UNIDAD",3.6579999999999999,null,null,{"$f":"IF(B17=\"\",\"\",(#REF!+G17+H17+#REF!))","v":{"$error":"#REF!"}},{"$error":"#REF!"}]
[null,7,"716000010022","BOLIGRAFO (LAPICERO) DE TINTA LIQUIDA PUNTA FINA COLOR  AZUL","UNIDAD",3.3,null,null,{"$f":"IF(B18=\"\",\"\",(#REF!+G18+H18+#REF!))","v":{"$error":"#REF!"}},{"$error":"#REF!"}]
[null,8,"716000010001","BOLIGRAFO (LAPICERO) DE TINTA LIQUIDA PUNTA FINA COLOR  NEGRO","UNIDAD",2.3954,null,null,{"$f":"IF(B19=\"\",\"\",(#REF!+G19+H19+#REF!))","v":{"$error":"#REF!"}},{"$error":"#REF!"}]
[null,9,"716000010002","BOLIGRAFO (LAPICERO) DE TINTA LIQUIDA PUNTA FINA COLOR  ROJO","UNIDAD",3.3,null,null,{"$f":"IF(B20=\"\",\"\",(#REF!+G20+H20+#REF!))","v":{"$error":"#REF!"}},{"$error":"#REF!"}]
[null,10,"716000010212","BOLIGRAFO (LAPICERO) DE TINTA SECA PUNTA MEDIA COLOR  AZUL","UNIDAD",0.4,null,null,{"$f":"IF(B21=\"\",\"\",(#REF!+G21+H21+#REF!))","v":{"$error":"#REF!"}},{"$error":"#REF!"}]
[null,11,"716000010213","BOLIGRAFO (LAPICERO) DE TINTA SECA PUNTA MEDIA COLOR  NEGRO","UNIDAD",0.4,null,null,{"$f":"IF(B22=\"\",\"\",(#REF!+G22+H22+#REF!))","v":{"$error":"#REF!"}},{"$error":"#REF!"}]
[null,12,"716000010214","BOLIGRAFO (LAPICERO) DE TINTA SECA PUNTA MEDIA COLOR  ROJO","UNIDAD",0.4,null,null,{"$f":"IF(B23=\"\",\"\",(#REF!+G23+H23+#REF!))","v":{"$error":"#REF!"}},{"$error":"#REF!"}]
[null,13,"711100010008","BORRADOR MIXTO TAMAÑO GRANDE","UNIDAD",0.8,null,null,{"$f":"IF(B24=\"\",\"\",(#REF!+G24+H24+#REF!))","v":{"$error":"#REF!"}},{"$error":"#REF!"}]
[null,14,"717300110160","CARTON PRENSADO N° 8 DE 70 cm X 100 cm","UNIDAD",8,null,null,{"$f":"IF(B25=\"\",\"\",(#REF!+G25+H25+#REF!))","v":{"$error":"#REF!"}},{"$error":"#REF!"}]
[null,15,"717300110328","CARTULINA CORRUGADA 100 g DE 50 cm X 70 cm DE COLOR","UNIDAD",0.23592399999999999,null,null,{"$f":"IF(B26=\"\",\"\",(#REF!+G26+H26+#REF!))","v":{"$error":"#REF!"}},{"$error":"#REF!"}]
[null,16,"717300110043","CARTULINA PLASTIFICADA DE 50 cm X 60 cm","UNIDAD",0.23592399999999999,null,null,{"$f":"IF(B27=\"\",\"\",(#REF!+G27+H27+#REF!))","v":{"$error":"#REF!"}},{"$error":"#REF!"}]
[null,17,"717300110094","CARTULINA PLASTIFICADA DE 50 cm X 65 cm COLOR AZUL","UNIDAD",0.23592399999999999,null,null,{"$f":"IF(B28=\"\",\"\",(#REF!+G28+H28+#REF!))","v":{"$error":"#REF!"}},{"$error":"#REF!"}]
[null,18,"717300110188","CARTULINA SATINADA 150 g  DE 70 cm X 100 cm","UNIDAD",0.23592399999999999,null,null,{"$f":"IF(B29=\"\",\"\",(#REF!+G29+H29+#REF!))","v":{"$error":"#REF!"}},{"$error":"#REF!"}]
[null,19,"717300110032","CARTULINA SATINADA 150 g DE 50 cm X 65 cm","UNIDAD",0.23592399999999999,null,null,{"$f":"IF(B30=\"\",\"\",(#REF!+G30+H30+#REF!))","v":{"$error":"#REF!"}},{"$error":"#REF!"}]
{"$rows_left_out":50}
{"sheet":"CATALOGO","index":3,"n_rows":349,"n_cols":6,"rows_kept":349,"cut":false,"hidden":false,"merged":[]}
["N°","CODIGO","NOMBRE DE ITEM","UNIDAD","PRECIO ESTIMADO","CLASIFICADOR"]
[1,"133000140205","AMBIENTADOR EN PASTILLA PARA BAÑO X 40 gr APROX.","UNIDAD",7]
[2,"133000140079","AMBIENTADOR EN SPRAY X 360 mL","UNIDAD",7,"2.3. 1 5. 3 1"]
[3,"133000140077","AMBIENTADOR EN SPRAY X 400 mL APROX.","UNIDAD",7,"2.3. 1 5. 3 1"]
[4,"133000140091","AMBIENTADOR EN SPRAY X 650 mL","UNIDAD",7,"2.3. 1 5. 3 1"]
[5,"646100080005","ANTISARRO PARA WATER","UNIDAD",3.2,"2.3. 1 5. 3 1"]
[6,"710600010012","ARCHIVADOR DE CARTON CON PALANCA LOMO ANCHO TAMAÑO OFICIO","UNIDAD",3.6579999999999999,"2.3. 1 5. 3 1"]
[7,"716000010022","BOLIGRAFO (LAPICERO) DE TINTA LIQUIDA PUNTA FINA COLOR  AZUL","UNIDAD",3.3,"2.3. 1 5. 3 1"]
[8,"716000010001","BOLIGRAFO (LAPICERO) DE TINTA LIQUIDA PUNTA FINA COLOR  NEGRO","UNIDAD",2.3954,"2.3. 1 5. 3 1"]
[9,"716000010002","BOLIGRAFO (LAPICERO) DE TINTA LIQUIDA PUNTA FINA COLOR  ROJO","UNIDAD",3.3,"2.3. 1 5. 3 1"]
[10,"716000010212","BOLIGRAFO (LAPICERO) DE TINTA SECA PUNTA MEDIA COLOR  AZUL","UNIDAD",0.4,"2.3. 1 5. 3 1"]
[11,"716000010213","BOLIGRAFO (LAPICERO) DE TINTA SECA PUNTA MEDIA COLOR  NEGRO","UNIDAD",0.4,"2.3. 1 5. 3 1"]
[12,"716000010214","BOLIGRAFO (LAPICERO) DE TINTA SECA PUNTA MEDIA COLOR  ROJO","UNIDAD",0.4,"2.3. 1 5. 3 1"]
[13,"711100010008","BORRADOR MIXTO TAMAÑO GRANDE","UNIDAD",0.8,"2.3. 1 5. 1 2"]
[14,"717300110160","CARTON PRENSADO N° 8 DE 70 cm X 100 cm","UNIDAD",8,"2.3. 1 3. 1 1"]
[15,"717300110328","CARTULINA CORRUGADA 100 g DE 50 cm X 70 cm DE COLOR","UNIDAD",0.23592399999999999]
[16,"717300110043","CARTULINA PLASTIFICADA DE 50 cm X 60 cm","UNIDAD",0.23592399999999999,"2.3. 1 9. 1 2"]
[17,"717300110094","CARTULINA PLASTIFICADA DE 50 cm X 65 cm COLOR AZUL","UNIDAD",0.23592399999999999,"2.3. 1 9. 1 2"]
[18,"717300110188","CARTULINA SATINADA 150 g  DE 70 cm X 100 cm","UNIDAD",0.23592399999999999,"2.3. 1 9. 1 2"]
[19,"717300110032","CARTULINA SATINADA 150 g DE 50 cm X 65 cm","UNIDAD",0.23592399999999999,"2.3. 1 9. 1 2"]
[20,"717300110332","CARTULINA SATINADA 150 g DE 50 cm X 65 cm  COLOR BLANCO","CIENTO",3,"2.3. 1 9. 1 2"]
[21,"717300110097","CARTULINA SATINADA 150 g DE 50 cm X 65 cm COLOR BLANCO","UNIDAD",0.23592399999999999,"2.3. 1 9. 1 2"]
[22,"717300110165","CARTULINA SATINADA 150 g DE 50 cm X 65 cm COLOR NEGRO","UNIDAD",0.23592399999999999,"2.3. 1 9. 1 2"]
[23,"717300110042","CARTULINA SATINADA 150 g DE 70 cm X 100 cm COLOR BLANCO","UNIDAD",0.23592399999999999,"2.3. 1 9. 1 2"]
[24,"717300110089","CARTULINA SIMPLE 120 g DE 70 cm X 100 cm COLOR BLANCO","UNIDAD",0.23592399999999999]
[25,"717300110329","CARTULINA SIMPLE 140 g 50 cm X 65 cm COLOR BLANCO","UNIDAD",0.23592399999999999,"2.3. 1 5. 1 2"]
[26,"717300110331","CARTULINA SIMPLE 140 g 50 cm X 65 cm COLOR NEGRO","UNIDAD",0.23592399999999999,"2.3. 1 5. 1 2"]
[27,"717300110403","CARTULINA SIMPLE 140 g 50 cm X 65 cm COLOR RAL 1016","UNIDAD",0.23592399999999999,"2.3. 1 5. 1 2"]
[28,"717300110404","CARTULINA SIMPLE 140 g 50 cm X 65 cm COLOR RAL 5015","UNIDAD",0.23592399999999999,"2.3. 1 5. 1 2"]
[29,"717300110405","CARTULINA SIMPLE 140 g 50 cm X 65 cm COLOR RAL 6001","UNIDAD",0.23592399999999999,"2.3. 1 5. 1 2"]
{"$rows_left_out":320}
{"sheet":"LISTADO IIEE","index":4,"n_rows":896,"n_cols":13,"rows_kept":896,"cut":false,"hidden":true,"merged":[]}
["N°","Distrito","Centro Poblado","Cód. Mod.","Nombre de IE","Nivel","Modalidad","Tipo IE","Total  de estudiantes matriculados (*)",null,"area","servicio de energia "]
[1,"Mañazo",null,"1360122","CEBA - MAÑAZO","Básica Alternativa - Avanzado",null,"Pública - Sector Educación",53,{"$f":"+B2","v":"Mañazo"},"Urbana",{"$f":"+IF(K2=\"Rural\",I2*2*12,IF(K2=\"Rural 1\",I2*3.5*12,IF(K2=\"Rural 2\",I2*3*12,IF(K2=\"Rural 3\",I2*2.5*12,IF(K2=\"Urbana\",I2*1.6*12,IF(K2=\"Urbana 1\",I2*1.3*12,0))))))","v":1017.6000000000001},{"$f":"+A2","v":1}]
[2,"Puno",null,"1360155","CEBA - 32","Básica Alternativa - Avanzado",null,"Pública - Sector Educación",128,"Puno","Urbana",2457.6000000000004,2]
[3,"Puno",null,"1360130","CEBA - 45 EMILIO ROMERO PADILLA","Básica Alternativa - Avanzado",null,"Pública - Sector Educación",78,"Puno","Urbana",1497.6000000000001,3]
[4,"Puno",null,"1024355","CEBA - 70025 INDEPENDENCIA NACIONAL","Básica Alternativa - Avanzado",null,"Pública - Sector Educación",58,"Puno","Urbana",1113.6000000000001,4]
[5,"Puno",null,"0239632","CEBA - 71013 GLORIOSO SAN CARLOS","Básica Alternativa - Avanzado",null,"Pública - Sector Educación",170,"Puno","Urbana",3264,{"$f":"+A6","v":5}]
[6,"Puno",null,"1564590","CEBA - APLICACION PEDAGOGICO PUNO","Básica Alternativa - Avanzado",null,"Pública - Sector Educación",0,"Puno","Urbana",0,6]
[7,"Puno",null,"1724855","CEBA - GUE SAN CARLOS","Básica Alternativa - Avanzado",null,"Pública - Sector Educación",208,"Puno","Urbana",3993.6000000000004,7]
[8,"Puno",null,"1360148","CEBA - JOSE ANTONIO ENCINAS","Básica Alternativa - Avanzado",null,"Pública - Sector Educación",155,"Puno","Urbana",2976,8]
[9,"Puno",null,"1024314","CEBA - SANTA ROSA","Básica Alternativa - Avanzado",null,"Pública - Sector Educación",79,"Puno","Urbana",1516.8000000000002,9]
[10,"Puno",null,"1331883","CEBA - VILLA DEL LAGO","Básica Alternativa - Avanzado",null,"Pública - Sector Educación",129,"Puno","Urbana",2476.8000000000002,10]
[11,"Puno",null,"1702331","CEBA - VIRGEN DE LA ASUNCION","Básica Alternativa - Avanzado",null,"Pública - Sector Educación",43,"Puno","Urbana",825.59999999999991,11]
[12,"Puno",null,"1025741","CEBA - 70025 INDEPENDENCIA NACIONAL","Básica Alternativa - Inicial e Intermedio",null,"Pública - Sector Educación",12,"Puno","Urbana",230.40000000000003,12]
[13,"Puno",null,"0240523","CEBA - 71013 GLORIOSO SAN CARLOS","Básica Alternativa - Inicial e Intermedio",null,"Pública - Sector Educación",42,"Puno","Urbana",806.40000000000009,13]
[14,"Puno",null,"0240408","CEBA - GUE SAN CARLOS","Básica Alternativa - Inicial e Intermedio",null,"Pública - Sector Educación",0,"Puno","Urbana",0,14]
[15,"Puno",null,"1024397","CEBA - JOSE ANTONIO ENCINAS","Básica Alternativa - Inicial e Intermedio",null,"Pública - Sector Educación",null,"Puno","Urbana",0,15]
[16,"Puno",null,"1764067","CEBA - VIRGEN DE LA ASUNCION","Básica Alternativa - Inicial e Intermedio",null,"Pública - Sector Educación",null,"Puno","Urbana",0,16]
[1,"ACORA","SACUYO","0229641","204","Inicial","Educación Básica Regular      ","A1  - Pública - Sector Educación                                  ",10,"ACORA","Rural 2",360,1]
[2,"ACORA","SOCCA","0539254","258","Inicial","Educación Básica Regular      ","A1  - Pública - Sector Educación                                  ",23,"ACORA","Rural 2",828,2]
[3,"ACORA","JAYU JAYU","0799437","312","Inicial","Educación Básica Regular      ","A1  - Pública - Sector Educación                                  ",15,"ACORA","Rural 3",450,3]
[4,"ACORA","JILATAMARCA","1414721","396","Inicial","Educación Básica Regular      ","A1  - Pública - Sector Educación                                  ",3,"ACORA","Rural 1",126,4]
[5,"ACORA","CULTA","1470939","1193","Inicial","Educación Básica Regular      ","A1  - Pública - Sector Educación                                  ",20,"ACORA","Rural 3",600,5]
[6,"ACORA","THUNUHUAYA","1556463","1206","Inicial","Educación Básica Regular      ","A1  - Pública - Sector Educación                                  ",11,"ACORA","Rural 2",396,6]
[7,"ACORA","QUELCA","1569714","1212","Inicial","Educación Básica Regular      ","A1  - Pública - Sector Educación                                  ",12,"ACORA","Rural 2",432,7]
[8,"ACORA","PIRCO","1621184","1238","Inicial","Educación Básica Regular      ","A1  - Pública - Sector Educación                                  ",4,"ACORA","Rural 1",168,8]
[9,"ACORA","AGUAS CALIENTES","1621408","1260","Inicial","Educación Básica Regular      ","A1  - Pública - Sector Educación                                  ",7,"ACORA","Rural 1",294,9]
[10,"ACORA","CIUDAD NUEVA","1662394","1308","Inicial","Educación Básica Regular      ","A1  - Pública - Sector Educación                                  ",6,"ACORA","Rural 3",180,10]
[11,"ACORA","ISCACHURO","1710672","70085","Inicial","Educación Básica Regular      ","A1  - Pública - Sector Educación                                  ",5,"ACORA","Rural 2",180,11]
[12,"ACORA","ISCATA","1710664","70158","Inicial","Educación Básica Regular      ","A1  - Pública - Sector Educación                                  ",11,"ACORA","Rural 2",396,12]
[13,"ACORA","CHANCACHI","1470962","1189 LA MERCED","Inicial","Educación Básica Regular      ","A1  - Pública - Sector Educación                                  ",10,"ACORA","Rural 2",360,13]
{"$rows_left_out":866}